{"text_format":"1","workbook":"xlsx","n_sheets":9,"sheets":["CCR_0","CCR_1","CCR_2","CCR_3","CCR_4","CCR_4A","Admin","Table","CFR_4a (2)"],"not_rendered":{"charts":0,"images":0,"macros":0,"external_links":0,"defined_names":5,"comments":0,"pivot_tables":0},"unopened":[],"bounds":{"document_bytes":16777216,"sheet_cells":100000,"rows_first":2000,"rows_last":500,"rows_between":2000,"halvings":0,"cell_chars":16384,"cell_head_chars":4096},"cells_cut":0,"cells_raw":0,"read":"whole","date_system":"1900"}

{"sheet":"CCR_0","index":0,"n_rows":97,"n_cols":19,"rows_kept":97,"cut":false,"hidden":false,"merged":[[3,2,3,3],[4,2,4,7],[3,4,3,5],[3,6,3,7],[11,9,11,14],[6,0,6,5],[3,13,3,14],[3,0,3,1],[4,0,4,1],[5,0,5,7],[7,0,7,1],[9,0,9,1],[8,0,8,1],[6,6,6,7],[11,0,11,7],[4,9,4,11],[5,9,5,11],[7,2,7,5],[18,0,19,0],[18,1,19,1],[18,9,19,9],[18,10,19,10],[15,10,15,14],[16,10,16,14],[12,0,12,1],[12,2,12,7],[13,0,13,1],[13,2,13,7],[14,0,14,1],[14,2,14,7],[15,0,15,1],[15,2,15,7],[16,0,16,1],[16,2,16,7],[12,9,13,14],[14,10,14,14],[18,13,19,13],[18,11,19,11],[18,2,18,3],[18,4,18,5],[18,6,18,7]]}
[{"$f":"COLUMN()","v":1},{"$f":"COLUMN()","v":2},{"$f":"COLUMN()","v":3},{"$f":"COLUMN()","v":4},{"$f":"COLUMN()","v":5},{"$f":"COLUMN()","v":6},{"$f":"COLUMN()","v":7},{"$f":"COLUMN()","v":8},{"$f":"COLUMN()","v":9},{"$f":"COLUMN()","v":10},{"$f":"COLUMN()","v":11},{"$f":"COLUMN()","v":12},null,{"$f":"COLUMN()","v":14},{"$f":"COLUMN()","v":15},{"$f":"COLUMN()","v":16},{"$f":"COLUMN()","v":17}]
[null,null,5,6,7,8,9,10,null,3,4,12,null,11]
[]
["TBI Provider ID",null,null,null,"NHTD Provider ID ",null,null,null,null,null,null,null,null,"Table of Contents"]
["Agency Name",null,null,null,null,null,null,null,null,"NEW YORK STATE",null,null,null,"Content","Tab"]
["New Agency",null,null,null,null,null,null,null,null,"CERTIFIED COST REPORT",null,null,null,"PROGRAM/SITE DATA","CCR_1"]
["Funding State Agency",null,null,null,null,null,"Reporting Period",null,null,null,null,null,null,"AGENCY FISCAL SUMMARY","CCR_2"]
[null,null,"DOH",null,null,null,"Start Date","End Date",null,"SCHEDULE CCR-0",null,null,null,"AGENCY ADMINISTRATION","CCR_3"]
[null,null,"TBI","NHTD","CAH I & II",null,"mm/dd/yyyy","mm/dd/yyyy",null,"AGENCY INFO",null,null,null,"PERSONAL SERVICE","CCR_4"]
["NO",null,null,null,"NO",null,null,null,null,"CERTIFICATION",null,"Rev. Feb. 2021",null,"CONTRACTED DIRECT CARE AND CLINICAL PERSONAL SERVICE","CCR_4A"]
[]
["Contact Information",null,null,null,null,null,null,null,null,"Certified (agency head)"]
["Name",null,null,null,null,null,null,null,null,{"$f":"\"I hereby affirm that I have reviewed all material submitted as part of this report and that these documents contain accurate information to the best of my knowledge. \" & IF(AND(K15<>\"\",K16<>\"\", K17<>\"\"), \" - VERIFIED -\", \"\")","v":"I hereby affirm that I have reviewed all material submitted as part of this report and that these documents contain accurate information to the best of my knowledge. "}]
["Title"]
["Phone",null,null,null,null,null,null,null,null,"Full Name"]
["Email",null,null,null,null,null,null,null,null,"Title"]
["Address",null,null,null,null,null,null,null,null,"Date"]
[]
["TID","Agency",1,null,2,null,3,null,null,"Program ID","Program Name","Rate Type",null,"Rate Code Description",{"$f":"+COUNTIFS($O$21:$O$100,\"YES\")","v":0}]
[null,null,"Rate","Type","Rate","Type","Rate","Type",null,null,null,null,null,null,"Select"]
[{"$f":"IF($B21=\"\",\"\",$B21&\".\" &COUNTIFS($B$20:$B21,$B21))","v":""},{"$f":"IF(AND($A$10=\"YES\", COUNTIFS($B$19:$B20,Table!$B$7)<Table!$B$5),Table!$B$7,IF(AND($C$10=\"YES\", COUNTIFS($B$19:$B20,Table!$C$7)<Table!$C$5),Table!$C$7, IF(AND($D$10=\"YES\", COUNTIFS($B$19:$B20,Table!$D$7)<Table!$D$5),Table!$D$7, IF(AND($E$10=\"YES\", COUNTIFS($B$19:$B20,Table!$E$7)<Table!$E$5),Table!$E$7, IF(AND($F$10=\"YES\", COUNTIFS($B$19:$B20,Table!$F$7)<Table!$F$5),Table!$F$7,\"\")))))","v":""},{"$f":"+IF($A21=\"\",\"\",VLOOKUP($A21,Table!$A$20:$L$185,C$2,0))","v":""},{"$f":"+IF($A21=\"\",\"\",VLOOKUP($A21,Table!$A$20:$L$185,D$2,0)&\"\")","v":""},{"$f":"+IF($A21=\"\",\"\",VLOOKUP($A21,Table!$A$20:$L$185,E$2,0))","v":""},{"$f":"+IF($A21=\"\",\"\",VLOOKUP($A21,Table!$A$20:$L$185,F$2,0)&\"\")","v":""},{"$f":"+IF($A21=\"\",\"\",VLOOKUP($A21,Table!$A$20:$L$185,G$2,0))","v":""},{"$f":"+IF($A21=\"\",\"\",VLOOKUP($A21,Table!$A$20:$L$185,H$2,0)&\"\")","v":""},null,{"$f":"+IF($A21=\"\",\"\",VLOOKUP($A21,Table!$A$20:$L$185,J$2,0))","v":""},{"$f":"+IF($A21=\"\",\"\",VLOOKUP($A21,Table!$A$20:$L$185,K$2,0))","v":""},{"$f":"+IF($A21=\"\",\"\",VLOOKUP($A21,Table!$A$20:$L$185,L$2,0))","v":""},null,{"$f":"+IF($A21=\"\",\"\",VLOOKUP($A21,Table!$A$20:$L$185,N$2,0))","v":""},null,{"$f":"+IF(AND($A21<>\"\",$O21=\"YES\"),COUNTIF($O$19:$O21,\"YES\")&\".YC\",\"\")","v":""},{"$f":"+IF(AND($A21<>\"\",$O21=\"YES\"),$A21,\"\")","v":""}]
[{"$f":"IF($B22=\"\",\"\",$B22&\".\" &COUNTIFS($B$20:$B22,$B22))","v":""},{"$f":"IF(AND($A$10=\"YES\", COUNTIFS($B$19:$B21,Table!$B$7)<Table!$B$5),Table!$B$7,IF(AND($C$10=\"YES\", COUNTIFS($B$19:$B21,Table!$C$7)<Table!$C$5),Table!$C$7, IF(AND($D$10=\"YES\", COUNTIFS($B$19:$B21,Table!$D$7)<Table!$D$5),Table!$D$7, IF(AND($E$10=\"YES\", COUNTIFS($B$19:$B21,Table!$E$7)<Table!$E$5),Table!$E$7, IF(AND($F$10=\"YES\", COUNTIFS($B$19:$B21,Table!$F$7)<Table!$F$5),Table!$F$7,\"\")))))","v":""},{"$f":"+IF($A22=\"\",\"\",VLOOKUP($A22,Table!$A$20:$L$185,C$2,0))","v":""},{"$f":"+IF($A22=\"\",\"\",VLOOKUP($A22,Table!$A$20:$L$185,D$2,0)&\"\")","v":""},{"$f":"+IF($A22=\"\",\"\",VLOOKUP($A22,Table!$A$20:$L$185,E$2,0))","v":""},{"$f":"+IF($A22=\"\",\"\",VLOOKUP($A22,Table!$A$20:$L$185,F$2,0)&\"\")","v":""},{"$f":"+IF($A22=\"\",\"\",VLOOKUP($A22,Table!$A$20:$L$185,G$2,0))","v":""},{"$f":"+IF($A22=\"\",\"\",VLOOKUP($A22,Table!$A$20:$L$185,H$2,0)&\"\")","v":""},null,{"$f":"+IF($A22=\"\",\"\",VLOOKUP($A22,Table!$A$20:$L$185,J$2,0))","v":""},{"$f":"+IF($A22=\"\",\"\",VLOOKUP($A22,Table!$A$20:$L$185,K$2,0))","v":""},{"$f":"+IF($A22=\"\",\"\",VLOOKUP($A22,Table!$A$20:$L$185,L$2,0))","v":""},null,{"$f":"+IF($A22=\"\",\"\",VLOOKUP($A22,Table!$A$20:$L$185,N$2,0))","v":""},null,{"$f":"+IF(AND($A22<>\"\",$O22=\"YES\"),COUNTIF($O$19:$O22,\"YES\")&\".YC\",\"\")","v":""},{"$f":"+IF(AND($A22<>\"\",$O22=\"YES\"),$A22,\"\")","v":""}]
[{"$f":"IF($B23=\"\",\"\",$B23&\".\" &COUNTIFS($B$20:$B23,$B23))","v":""},{"$f":"IF(AND($A$10=\"YES\", COUNTIFS($B$19:$B22,Table!$B$7)<Table!$B$5),Table!$B$7,IF(AND($C$10=\"YES\", COUNTIFS($B$19:$B22,Table!$C$7)<Table!$C$5),Table!$C$7, IF(AND($D$10=\"YES\", COUNTIFS($B$19:$B22,Table!$D$7)<Table!$D$5),Table!$D$7, IF(AND($E$10=\"YES\", COUNTIFS($B$19:$B22,Table!$E$7)<Table!$E$5),Table!$E$7, IF(AND($F$10=\"YES\", COUNTIFS($B$19:$B22,Table!$F$7)<Table!$F$5),Table!$F$7,\"\")))))","v":""},{"$f":"+IF($A23=\"\",\"\",VLOOKUP($A23,Table!$A$20:$L$185,C$2,0))","v":""},{"$f":"+IF($A23=\"\",\"\",VLOOKUP($A23,Table!$A$20:$L$185,D$2,0)&\"\")","v":""},{"$f":"+IF($A23=\"\",\"\",VLOOKUP($A23,Table!$A$20:$L$185,E$2,0))","v":""},{"$f":"+IF($A23=\"\",\"\",VLOOKUP($A23,Table!$A$20:$L$185,F$2,0)&\"\")","v":""},{"$f":"+IF($A23=\"\",\"\",VLOOKUP($A23,Table!$A$20:$L$185,G$2,0))","v":""},{"$f":"+IF($A23=\"\",\"\",VLOOKUP($A23,Table!$A$20:$L$185,H$2,0)&\"\")","v":""},null,{"$f":"+IF($A23=\"\",\"\",VLOOKUP($A23,Table!$A$20:$L$185,J$2,0))","v":""},{"$f":"+IF($A23=\"\",\"\",VLOOKUP($A23,Table!$A$20:$L$185,K$2,0))","v":""},{"$f":"+IF($A23=\"\",\"\",VLOOKUP($A23,Table!$A$20:$L$185,L$2,0))","v":""},null,{"$f":"+IF($A23=\"\",\"\",VLOOKUP($A23,Table!$A$20:$L$185,N$2,0))","v":""},null,{"$f":"+IF(AND($A23<>\"\",$O23=\"YES\"),COUNTIF($O$19:$O23,\"YES\")&\".YC\",\"\")","v":""},""]
[{"$f":"IF($B24=\"\",\"\",$B24&\".\" &COUNTIFS($B$20:$B24,$B24))","v":""},{"$f":"IF(AND($A$10=\"YES\", COUNTIFS($B$19:$B23,Table!$B$7)<Table!$B$5),Table!$B$7,IF(AND($C$10=\"YES\", COUNTIFS($B$19:$B23,Table!$C$7)<Table!$C$5),Table!$C$7, IF(AND($D$10=\"YES\", COUNTIFS($B$19:$B23,Table!$D$7)<Table!$D$5),Table!$D$7, IF(AND($E$10=\"YES\", COUNTIFS($B$19:$B23,Table!$E$7)<Table!$E$5),Table!$E$7, IF(AND($F$10=\"YES\", COUNTIFS($B$19:$B23,Table!$F$7)<Table!$F$5),Table!$F$7,\"\")))))","v":""},{"$f":"+IF($A24=\"\",\"\",VLOOKUP($A24,Table!$A$20:$L$185,C$2,0))","v":""},{"$f":"+IF($A24=\"\",\"\",VLOOKUP($A24,Table!$A$20:$L$185,D$2,0)&\"\")","v":""},{"$f":"+IF($A24=\"\",\"\",VLOOKUP($A24,Table!$A$20:$L$185,E$2,0))","v":""},{"$f":"+IF($A24=\"\",\"\",VLOOKUP($A24,Table!$A$20:$L$185,F$2,0)&\"\")","v":""},{"$f":"+IF($A24=\"\",\"\",VLOOKUP($A24,Table!$A$20:$L$185,G$2,0))","v":""},{"$f":"+IF($A24=\"\",\"\",VLOOKUP($A24,Table!$A$20:$L$185,H$2,0)&\"\")","v":""},null,{"$f":"+IF($A24=\"\",\"\",VLOOKUP($A24,Table!$A$20:$L$185,J$2,0))","v":""},{"$f":"+IF($A24=\"\",\"\",VLOOKUP($A24,Table!$A$20:$L$185,K$2,0))","v":""},{"$f":"+IF($A24=\"\",\"\",VLOOKUP($A24,Table!$A$20:$L$185,L$2,0))","v":""},null,{"$f":"+IF($A24=\"\",\"\",VLOOKUP($A24,Table!$A$20:$L$185,N$2,0))","v":""},null,{"$f":"+IF(AND($A24<>\"\",$O24=\"YES\"),COUNTIF($O$19:$O24,\"YES\")&\".YC\",\"\")","v":""},""]
[{"$f":"IF($B25=\"\",\"\",$B25&\".\" &COUNTIFS($B$20:$B25,$B25))","v":""},{"$f":"IF(AND($A$10=\"YES\", COUNTIFS($B$19:$B24,Table!$B$7)<Table!$B$5),Table!$B$7,IF(AND($C$10=\"YES\", COUNTIFS($B$19:$B24,Table!$C$7)<Table!$C$5),Table!$C$7, IF(AND($D$10=\"YES\", COUNTIFS($B$19:$B24,Table!$D$7)<Table!$D$5),Table!$D$7, IF(AND($E$10=\"YES\", COUNTIFS($B$19:$B24,Table!$E$7)<Table!$E$5),Table!$E$7, IF(AND($F$10=\"YES\", COUNTIFS($B$19:$B24,Table!$F$7)<Table!$F$5),Table!$F$7,\"\")))))","v":""},{"$f":"+IF($A25=\"\",\"\",VLOOKUP($A25,Table!$A$20:$L$185,C$2,0))","v":""},{"$f":"+IF($A25=\"\",\"\",VLOOKUP($A25,Table!$A$20:$L$185,D$2,0)&\"\")","v":""},{"$f":"+IF($A25=\"\",\"\",VLOOKUP($A25,Table!$A$20:$L$185,E$2,0))","v":""},{"$f":"+IF($A25=\"\",\"\",VLOOKUP($A25,Table!$A$20:$L$185,F$2,0)&\"\")","v":""},{"$f":"+IF($A25=\"\",\"\",VLOOKUP($A25,Table!$A$20:$L$185,G$2,0))","v":""},{"$f":"+IF($A25=\"\",\"\",VLOOKUP($A25,Table!$A$20:$L$185,H$2,0)&\"\")","v":""},null,{"$f":"+IF($A25=\"\",\"\",VLOOKUP($A25,Table!$A$20:$L$185,J$2,0))","v":""},{"$f":"+IF($A25=\"\",\"\",VLOOKUP($A25,Table!$A$20:$L$185,K$2,0))","v":""},{"$f":"+IF($A25=\"\",\"\",VLOOKUP($A25,Table!$A$20:$L$185,L$2,0))","v":""},null,{"$f":"+IF($A25=\"\",\"\",VLOOKUP($A25,Table!$A$20:$L$185,N$2,0))","v":""},null,{"$f":"+IF(AND($A25<>\"\",$O25=\"YES\"),COUNTIF($O$19:$O25,\"YES\")&\".YC\",\"\")","v":""},""]
[{"$f":"IF($B26=\"\",\"\",$B26&\".\" &COUNTIFS($B$20:$B26,$B26))","v":""},{"$f":"IF(AND($A$10=\"YES\", COUNTIFS($B$19:$B25,Table!$B$7)<Table!$B$5),Table!$B$7,IF(AND($C$10=\"YES\", COUNTIFS($B$19:$B25,Table!$C$7)<Table!$C$5),Table!$C$7, IF(AND($D$10=\"YES\", COUNTIFS($B$19:$B25,Table!$D$7)<Table!$D$5),Table!$D$7, IF(AND($E$10=\"YES\", COUNTIFS($B$19:$B25,Table!$E$7)<Table!$E$5),Table!$E$7, IF(AND($F$10=\"YES\", COUNTIFS($B$19:$B25,Table!$F$7)<Table!$F$5),Table!$F$7,\"\")))))","v":""},{"$f":"+IF($A26=\"\",\"\",VLOOKUP($A26,Table!$A$20:$L$185,C$2,0))","v":""},{"$f":"+IF($A26=\"\",\"\",VLOOKUP($A26,Table!$A$20:$L$185,D$2,0)&\"\")","v":""},{"$f":"+IF($A26=\"\",\"\",VLOOKUP($A26,Table!$A$20:$L$185,E$2,0))","v":""},{"$f":"+IF($A26=\"\",\"\",VLOOKUP($A26,Table!$A$20:$L$185,F$2,0)&\"\")","v":""},{"$f":"+IF($A26=\"\",\"\",VLOOKUP($A26,Table!$A$20:$L$185,G$2,0))","v":""},{"$f":"+IF($A26=\"\",\"\",VLOOKUP($A26,Table!$A$20:$L$185,H$2,0)&\"\")","v":""},null,{"$f":"+IF($A26=\"\",\"\",VLOOKUP($A26,Table!$A$20:$L$185,J$2,0))","v":""},{"$f":"+IF($A26=\"\",\"\",VLOOKUP($A26,Table!$A$20:$L$185,K$2,0))","v":""},{"$f":"+IF($A26=\"\",\"\",VLOOKUP($A26,Table!$A$20:$L$185,L$2,0))","v":""},null,{"$f":"+IF($A26=\"\",\"\",VLOOKUP($A26,Table!$A$20:$L$185,N$2,0))","v":""},null,{"$f":"+IF(AND($A26<>\"\",$O26=\"YES\"),COUNTIF($O$19:$O26,\"YES\")&\".YC\",\"\")","v":""},""]
[{"$f":"IF($B27=\"\",\"\",$B27&\".\" &COUNTIFS($B$20:$B27,$B27))","v":""},{"$f":"IF(AND($A$10=\"YES\", COUNTIFS($B$19:$B26,Table!$B$7)<Table!$B$5),Table!$B$7,IF(AND($C$10=\"YES\", COUNTIFS($B$19:$B26,Table!$C$7)<Table!$C$5),Table!$C$7, IF(AND($D$10=\"YES\", COUNTIFS($B$19:$B26,Table!$D$7)<Table!$D$5),Table!$D$7, IF(AND($E$10=\"YES\", COUNTIFS($B$19:$B26,Table!$E$7)<Table!$E$5),Table!$E$7, IF(AND($F$10=\"YES\", COUNTIFS($B$19:$B26,Table!$F$7)<Table!$F$5),Table!$F$7,\"\")))))","v":""},{"$f":"+IF($A27=\"\",\"\",VLOOKUP($A27,Table!$A$20:$L$185,C$2,0))","v":""},{"$f":"+IF($A27=\"\",\"\",VLOOKUP($A27,Table!$A$20:$L$185,D$2,0)&\"\")","v":""},{"$f":"+IF($A27=\"\",\"\",VLOOKUP($A27,Table!$A$20:$L$185,E$2,0))","v":""},{"$f":"+IF($A27=\"\",\"\",VLOOKUP($A27,Table!$A$20:$L$185,F$2,0)&\"\")","v":""},{"$f":"+IF($A27=\"\",\"\",VLOOKUP($A27,Table!$A$20:$L$185,G$2,0))","v":""},{"$f":"+IF($A27=\"\",\"\",VLOOKUP($A27,Table!$A$20:$L$185,H$2,0)&\"\")","v":""},null,{"$f":"+IF($A27=\"\",\"\",VLOOKUP($A27,Table!$A$20:$L$185,J$2,0))","v":""},{"$f":"+IF($A27=\"\",\"\",VLOOKUP($A27,Table!$A$20:$L$185,K$2,0))","v":""},{"$f":"+IF($A27=\"\",\"\",VLOOKUP($A27,Table!$A$20:$L$185,L$2,0))","v":""},null,{"$f":"+IF($A27=\"\",\"\",VLOOKUP($A27,Table!$A$20:$L$185,N$2,0))","v":""},null,{"$f":"+IF(AND($A27<>\"\",$O27=\"YES\"),COUNTIF($O$19:$O27,\"YES\")&\".YC\",\"\")","v":""},""]
[{"$f":"IF($B28=\"\",\"\",$B28&\".\" &COUNTIFS($B$20:$B28,$B28))","v":""},{"$f":"IF(AND($A$10=\"YES\", COUNTIFS($B$19:$B27,Table!$B$7)<Table!$B$5),Table!$B$7,IF(AND($C$10=\"YES\", COUNTIFS($B$19:$B27,Table!$C$7)<Table!$C$5),Table!$C$7, IF(AND($D$10=\"YES\", COUNTIFS($B$19:$B27,Table!$D$7)<Table!$D$5),Table!$D$7, IF(AND($E$10=\"YES\", COUNTIFS($B$19:$B27,Table!$E$7)<Table!$E$5),Table!$E$7, IF(AND($F$10=\"YES\", COUNTIFS($B$19:$B27,Table!$F$7)<Table!$F$5),Table!$F$7,\"\")))))","v":""},{"$f":"+IF($A28=\"\",\"\",VLOOKUP($A28,Table!$A$20:$L$185,C$2,0))","v":""},{"$f":"+IF($A28=\"\",\"\",VLOOKUP($A28,Table!$A$20:$L$185,D$2,0)&\"\")","v":""},{"$f":"+IF($A28=\"\",\"\",VLOOKUP($A28,Table!$A$20:$L$185,E$2,0))","v":""},{"$f":"+IF($A28=\"\",\"\",VLOOKUP($A28,Table!$A$20:$L$185,F$2,0)&\"\")","v":""},{"$f":"+IF($A28=\"\",\"\",VLOOKUP($A28,Table!$A$20:$L$185,G$2,0))","v":""},{"$f":"+IF($A28=\"\",\"\",VLOOKUP($A28,Table!$A$20:$L$185,H$2,0)&\"\")","v":""},null,{"$f":"+IF($A28=\"\",\"\",VLOOKUP($A28,Table!$A$20:$L$185,J$2,0))","v":""},{"$f":"+IF($A28=\"\",\"\",VLOOKUP($A28,Table!$A$20:$L$185,K$2,0))","v":""},{"$f":"+IF($A28=\"\",\"\",VLOOKUP($A28,Table!$A$20:$L$185,L$2,0))","v":""},null,{"$f":"+IF($A28=\"\",\"\",VLOOKUP($A28,Table!$A$20:$L$185,N$2,0))","v":""},null,{"$f":"+IF(AND($A28<>\"\",$O28=\"YES\"),COUNTIF($O$19:$O28,\"YES\")&\".YC\",\"\")","v":""},""]
[{"$f":"IF($B29=\"\",\"\",$B29&\".\" &COUNTIFS($B$20:$B29,$B29))","v":""},{"$f":"IF(AND($A$10=\"YES\", COUNTIFS($B$19:$B28,Table!$B$7)<Table!$B$5),Table!$B$7,IF(AND($C$10=\"YES\", COUNTIFS($B$19:$B28,Table!$C$7)<Table!$C$5),Table!$C$7, IF(AND($D$10=\"YES\", COUNTIFS($B$19:$B28,Table!$D$7)<Table!$D$5),Table!$D$7, IF(AND($E$10=\"YES\", COUNTIFS($B$19:$B28,Table!$E$7)<Table!$E$5),Table!$E$7, IF(AND($F$10=\"YES\", COUNTIFS($B$19:$B28,Table!$F$7)<Table!$F$5),Table!$F$7,\"\")))))","v":""},{"$f":"+IF($A29=\"\",\"\",VLOOKUP($A29,Table!$A$20:$L$185,C$2,0))","v":""},{"$f":"+IF($A29=\"\",\"\",VLOOKUP($A29,Table!$A$20:$L$185,D$2,0)&\"\")","v":""},{"$f":"+IF($A29=\"\",\"\",VLOOKUP($A29,Table!$A$20:$L$185,E$2,0))","v":""},{"$f":"+IF($A29=\"\",\"\",VLOOKUP($A29,Table!$A$20:$L$185,F$2,0)&\"\")","v":""},{"$f":"+IF($A29=\"\",\"\",VLOOKUP($A29,Table!$A$20:$L$185,G$2,0))","v":""},{"$f":"+IF($A29=\"\",\"\",VLOOKUP($A29,Table!$A$20:$L$185,H$2,0)&\"\")","v":""},null,{"$f":"+IF($A29=\"\",\"\",VLOOKUP($A29,Table!$A$20:$L$185,J$2,0))","v":""},{"$f":"+IF($A29=\"\",\"\",VLOOKUP($A29,Table!$A$20:$L$185,K$2,0))","v":""},{"$f":"+IF($A29=\"\",\"\",VLOOKUP($A29,Table!$A$20:$L$185,L$2,0))","v":""},null,{"$f":"+IF($A29=\"\",\"\",VLOOKUP($A29,Table!$A$20:$L$185,N$2,0))","v":""},null,{"$f":"+IF(AND($A29<>\"\",$O29=\"YES\"),COUNTIF($O$19:$O29,\"YES\")&\".YC\",\"\")","v":""},""]
[{"$f":"IF($B30=\"\",\"\",$B30&\".\" &COUNTIFS($B$20:$B30,$B30))","v":""},{"$f":"IF(AND($A$10=\"YES\", COUNTIFS($B$19:$B29,Table!$B$7)<Table!$B$5),Table!$B$7,IF(AND($C$10=\"YES\", COUNTIFS($B$19:$B29,Table!$C$7)<Table!$C$5),Table!$C$7, IF(AND($D$10=\"YES\", COUNTIFS($B$19:$B29,Table!$D$7)<Table!$D$5),Table!$D$7, IF(AND($E$10=\"YES\", COUNTIFS($B$19:$B29,Table!$E$7)<Table!$E$5),Table!$E$7, IF(AND($F$10=\"YES\", COUNTIFS($B$19:$B29,Table!$F$7)<Table!$F$5),Table!$F$7,\"\")))))","v":""},{"$f":"+IF($A30=\"\",\"\",VLOOKUP($A30,Table!$A$20:$L$185,C$2,0))","v":""},{"$f":"+IF($A30=\"\",\"\",VLOOKUP($A30,Table!$A$20:$L$185,D$2,0)&\"\")","v":""},{"$f":"+IF($A30=\"\",\"\",VLOOKUP($A30,Table!$A$20:$L$185,E$2,0))","v":""},{"$f":"+IF($A30=\"\",\"\",VLOOKUP($A30,Table!$A$20:$L$185,F$2,0)&\"\")","v":""},{"$f":"+IF($A30=\"\",\"\",VLOOKUP($A30,Table!$A$20:$L$185,G$2,0))","v":""},{"$f":"+IF($A30=\"\",\"\",VLOOKUP($A30,Table!$A$20:$L$185,H$2,0)&\"\")","v":""},null,{"$f":"+IF($A30=\"\",\"\",VLOOKUP($A30,Table!$A$20:$L$185,J$2,0))","v":""},{"$f":"+IF($A30=\"\",\"\",VLOOKUP($A30,Table!$A$20:$L$185,K$2,0))","v":""},{"$f":"+IF($A30=\"\",\"\",VLOOKUP($A30,Table!$A$20:$L$185,L$2,0))","v":""},null,{"$f":"+IF($A30=\"\",\"\",VLOOKUP($A30,Table!$A$20:$L$185,N$2,0))","v":""},null,{"$f":"+IF(AND($A30<>\"\",$O30=\"YES\"),COUNTIF($O$19:$O30,\"YES\")&\".YC\",\"\")","v":""},""]
[{"$f":"IF($B31=\"\",\"\",$B31&\".\" &COUNTIFS($B$20:$B31,$B31))","v":""},{"$f":"IF(AND($A$10=\"YES\", COUNTIFS($B$19:$B30,Table!$B$7)<Table!$B$5),Table!$B$7,IF(AND($C$10=\"YES\", COUNTIFS($B$19:$B30,Table!$C$7)<Table!$C$5),Table!$C$7, IF(AND($D$10=\"YES\", COUNTIFS($B$19:$B30,Table!$D$7)<Table!$D$5),Table!$D$7, IF(AND($E$10=\"YES\", COUNTIFS($B$19:$B30,Table!$E$7)<Table!$E$5),Table!$E$7, IF(AND($F$10=\"YES\", COUNTIFS($B$19:$B30,Table!$F$7)<Table!$F$5),Table!$F$7,\"\")))))","v":""},{"$f":"+IF($A31=\"\",\"\",VLOOKUP($A31,Table!$A$20:$L$185,C$2,0))","v":""},{"$f":"+IF($A31=\"\",\"\",VLOOKUP($A31,Table!$A$20:$L$185,D$2,0)&\"\")","v":""},{"$f":"+IF($A31=\"\",\"\",VLOOKUP($A31,Table!$A$20:$L$185,E$2,0))","v":""},{"$f":"+IF($A31=\"\",\"\",VLOOKUP($A31,Table!$A$20:$L$185,F$2,0)&\"\")","v":""},{"$f":"+IF($A31=\"\",\"\",VLOOKUP($A31,Table!$A$20:$L$185,G$2,0))","v":""},{"$f":"+IF($A31=\"\",\"\",VLOOKUP($A31,Table!$A$20:$L$185,H$2,0)&\"\")","v":""},null,{"$f":"+IF($A31=\"\",\"\",VLOOKUP($A31,Table!$A$20:$L$185,J$2,0))","v":""},{"$f":"+IF($A31=\"\",\"\",VLOOKUP($A31,Table!$A$20:$L$185,K$2,0))","v":""},{"$f":"+IF($A31=\"\",\"\",VLOOKUP($A31,Table!$A$20:$L$185,L$2,0))","v":""},null,{"$f":"+IF($A31=\"\",\"\",VLOOKUP($A31,Table!$A$20:$L$185,N$2,0))","v":""},null,{"$f":"+IF(AND($A31<>\"\",$O31=\"YES\"),COUNTIF($O$19:$O31,\"YES\")&\".YC\",\"\")","v":""},""]
[{"$f":"IF($B32=\"\",\"\",$B32&\".\" &COUNTIFS($B$20:$B32,$B32))","v":""},{"$f":"IF(AND($A$10=\"YES\", COUNTIFS($B$19:$B31,Table!$B$7)<Table!$B$5),Table!$B$7,IF(AND($C$10=\"YES\", COUNTIFS($B$19:$B31,Table!$C$7)<Table!$C$5),Table!$C$7, IF(AND($D$10=\"YES\", COUNTIFS($B$19:$B31,Table!$D$7)<Table!$D$5),Table!$D$7, IF(AND($E$10=\"YES\", COUNTIFS($B$19:$B31,Table!$E$7)<Table!$E$5),Table!$E$7, IF(AND($F$10=\"YES\", COUNTIFS($B$19:$B31,Table!$F$7)<Table!$F$5),Table!$F$7,\"\")))))","v":""},{"$f":"+IF($A32=\"\",\"\",VLOOKUP($A32,Table!$A$20:$L$185,C$2,0))","v":""},{"$f":"+IF($A32=\"\",\"\",VLOOKUP($A32,Table!$A$20:$L$185,D$2,0)&\"\")","v":""},{"$f":"+IF($A32=\"\",\"\",VLOOKUP($A32,Table!$A$20:$L$185,E$2,0))","v":""},{"$f":"+IF($A32=\"\",\"\",VLOOKUP($A32,Table!$A$20:$L$185,F$2,0)&\"\")","v":""},{"$f":"+IF($A32=\"\",\"\",VLOOKUP($A32,Table!$A$20:$L$185,G$2,0))","v":""},{"$f":"+IF($A32=\"\",\"\",VLOOKUP($A32,Table!$A$20:$L$185,H$2,0)&\"\")","v":""},null,{"$f":"+IF($A32=\"\",\"\",VLOOKUP($A32,Table!$A$20:$L$185,J$2,0))","v":""},{"$f":"+IF($A32=\"\",\"\",VLOOKUP($A32,Table!$A$20:$L$185,K$2,0))","v":""},{"$f":"+IF($A32=\"\",\"\",VLOOKUP($A32,Table!$A$20:$L$185,L$2,0))","v":""},null,{"$f":"+IF($A32=\"\",\"\",VLOOKUP($A32,Table!$A$20:$L$185,N$2,0))","v":""},null,{"$f":"+IF(AND($A32<>\"\",$O32=\"YES\"),COUNTIF($O$19:$O32,\"YES\")&\".YC\",\"\")","v":""},""]
[{"$f":"IF($B33=\"\",\"\",$B33&\".\" &COUNTIFS($B$20:$B33,$B33))","v":""},{"$f":"IF(AND($A$10=\"YES\", COUNTIFS($B$19:$B32,Table!$B$7)<Table!$B$5),Table!$B$7,IF(AND($C$10=\"YES\", COUNTIFS($B$19:$B32,Table!$C$7)<Table!$C$5),Table!$C$7, IF(AND($D$10=\"YES\", COUNTIFS($B$19:$B32,Table!$D$7)<Table!$D$5),Table!$D$7, IF(AND($E$10=\"YES\", COUNTIFS($B$19:$B32,Table!$E$7)<Table!$E$5),Table!$E$7, IF(AND($F$10=\"YES\", COUNTIFS($B$19:$B32,Table!$F$7)<Table!$F$5),Table!$F$7,\"\")))))","v":""},{"$f":"+IF($A33=\"\",\"\",VLOOKUP($A33,Table!$A$20:$L$185,C$2,0))","v":""},{"$f":"+IF($A33=\"\",\"\",VLOOKUP($A33,Table!$A$20:$L$185,D$2,0)&\"\")","v":""},{"$f":"+IF($A33=\"\",\"\",VLOOKUP($A33,Table!$A$20:$L$185,E$2,0))","v":""},{"$f":"+IF($A33=\"\",\"\",VLOOKUP($A33,Table!$A$20:$L$185,F$2,0)&\"\")","v":""},{"$f":"+IF($A33=\"\",\"\",VLOOKUP($A33,Table!$A$20:$L$185,G$2,0))","v":""},{"$f":"+IF($A33=\"\",\"\",VLOOKUP($A33,Table!$A$20:$L$185,H$2,0)&\"\")","v":""},null,{"$f":"+IF($A33=\"\",\"\",VLOOKUP($A33,Table!$A$20:$L$185,J$2,0))","v":""},{"$f":"+IF($A33=\"\",\"\",VLOOKUP($A33,Table!$A$20:$L$185,K$2,0))","v":""},{"$f":"+IF($A33=\"\",\"\",VLOOKUP($A33,Table!$A$20:$L$185,L$2,0))","v":""},null,{"$f":"+IF($A33=\"\",\"\",VLOOKUP($A33,Table!$A$20:$L$185,N$2,0))","v":""},null,{"$f":"+IF(AND($A33<>\"\",$O33=\"YES\"),COUNTIF($O$19:$O33,\"YES\")&\".YC\",\"\")","v":""},""]
[{"$f":"IF($B34=\"\",\"\",$B34&\".\" &COUNTIFS($B$20:$B34,$B34))","v":""},{"$f":"IF(AND($A$10=\"YES\", COUNTIFS($B$19:$B33,Table!$B$7)<Table!$B$5),Table!$B$7,IF(AND($C$10=\"YES\", COUNTIFS($B$19:$B33,Table!$C$7)<Table!$C$5),Table!$C$7, IF(AND($D$10=\"YES\", COUNTIFS($B$19:$B33,Table!$D$7)<Table!$D$5),Table!$D$7, IF(AND($E$10=\"YES\", COUNTIFS($B$19:$B33,Table!$E$7)<Table!$E$5),Table!$E$7, IF(AND($F$10=\"YES\", COUNTIFS($B$19:$B33,Table!$F$7)<Table!$F$5),Table!$F$7,\"\")))))","v":""},{"$f":"+IF($A34=\"\",\"\",VLOOKUP($A34,Table!$A$20:$L$185,C$2,0))","v":""},{"$f":"+IF($A34=\"\",\"\",VLOOKUP($A34,Table!$A$20:$L$185,D$2,0)&\"\")","v":""},{"$f":"+IF($A34=\"\",\"\",VLOOKUP($A34,Table!$A$20:$L$185,E$2,0))","v":""},{"$f":"+IF($A34=\"\",\"\",VLOOKUP($A34,Table!$A$20:$L$185,F$2,0)&\"\")","v":""},{"$f":"+IF($A34=\"\",\"\",VLOOKUP($A34,Table!$A$20:$L$185,G$2,0))","v":""},{"$f":"+IF($A34=\"\",\"\",VLOOKUP($A34,Table!$A$20:$L$185,H$2,0)&\"\")","v":""},null,{"$f":"+IF($A34=\"\",\"\",VLOOKUP($A34,Table!$A$20:$L$185,J$2,0))","v":""},{"$f":"+IF($A34=\"\",\"\",VLOOKUP($A34,Table!$A$20:$L$185,K$2,0))","v":""},{"$f":"+IF($A34=\"\",\"\",VLOOKUP($A34,Table!$A$20:$L$185,L$2,0))","v":""},null,{"$f":"+IF($A34=\"\",\"\",VLOOKUP($A34,Table!$A$20:$L$185,N$2,0))","v":""},null,{"$f":"+IF(AND($A34<>\"\",$O34=\"YES\"),COUNTIF($O$19:$O34,\"YES\")&\".YC\",\"\")","v":""},""]
[{"$f":"IF($B35=\"\",\"\",$B35&\".\" &COUNTIFS($B$20:$B35,$B35))","v":""},{"$f":"IF(AND($A$10=\"YES\", COUNTIFS($B$19:$B34,Table!$B$7)<Table!$B$5),Table!$B$7,IF(AND($C$10=\"YES\", COUNTIFS($B$19:$B34,Table!$C$7)<Table!$C$5),Table!$C$7, IF(AND($D$10=\"YES\", COUNTIFS($B$19:$B34,Table!$D$7)<Table!$D$5),Table!$D$7, IF(AND($E$10=\"YES\", COUNTIFS($B$19:$B34,Table!$E$7)<Table!$E$5),Table!$E$7, IF(AND($F$10=\"YES\", COUNTIFS($B$19:$B34,Table!$F$7)<Table!$F$5),Table!$F$7,\"\")))))","v":""},{"$f":"+IF($A35=\"\",\"\",VLOOKUP($A35,Table!$A$20:$L$185,C$2,0))","v":""},{"$f":"+IF($A35=\"\",\"\",VLOOKUP($A35,Table!$A$20:$L$185,D$2,0)&\"\")","v":""},{"$f":"+IF($A35=\"\",\"\",VLOOKUP($A35,Table!$A$20:$L$185,E$2,0))","v":""},{"$f":"+IF($A35=\"\",\"\",VLOOKUP($A35,Table!$A$20:$L$185,F$2,0)&\"\")","v":""},{"$f":"+IF($A35=\"\",\"\",VLOOKUP($A35,Table!$A$20:$L$185,G$2,0))","v":""},{"$f":"+IF($A35=\"\",\"\",VLOOKUP($A35,Table!$A$20:$L$185,H$2,0)&\"\")","v":""},null,{"$f":"+IF($A35=\"\",\"\",VLOOKUP($A35,Table!$A$20:$L$185,J$2,0))","v":""},{"$f":"+IF($A35=\"\",\"\",VLOOKUP($A35,Table!$A$20:$L$185,K$2,0))","v":""},{"$f":"+IF($A35=\"\",\"\",VLOOKUP($A35,Table!$A$20:$L$185,L$2,0))","v":""},null,{"$f":"+IF($A35=\"\",\"\",VLOOKUP($A35,Table!$A$20:$L$185,N$2,0))","v":""},null,{"$f":"+IF(AND($A35<>\"\",$O35=\"YES\"),COUNTIF($O$19:$O35,\"YES\")&\".YC\",\"\")","v":""},""]
[{"$f":"IF($B36=\"\",\"\",$B36&\".\" &COUNTIFS($B$20:$B36,$B36))","v":""},{"$f":"IF(AND($A$10=\"YES\", COUNTIFS($B$19:$B35,Table!$B$7)<Table!$B$5),Table!$B$7,IF(AND($C$10=\"YES\", COUNTIFS($B$19:$B35,Table!$C$7)<Table!$C$5),Table!$C$7, IF(AND($D$10=\"YES\", COUNTIFS($B$19:$B35,Table!$D$7)<Table!$D$5),Table!$D$7, IF(AND($E$10=\"YES\", COUNTIFS($B$19:$B35,Table!$E$7)<Table!$E$5),Table!$E$7, IF(AND($F$10=\"YES\", COUNTIFS($B$19:$B35,Table!$F$7)<Table!$F$5),Table!$F$7,\"\")))))","v":""},{"$f":"+IF($A36=\"\",\"\",VLOOKUP($A36,Table!$A$20:$L$185,C$2,0))","v":""},{"$f":"+IF($A36=\"\",\"\",VLOOKUP($A36,Table!$A$20:$L$185,D$2,0)&\"\")","v":""},{"$f":"+IF($A36=\"\",\"\",VLOOKUP($A36,Table!$A$20:$L$185,E$2,0))","v":""},{"$f":"+IF($A36=\"\",\"\",VLOOKUP($A36,Table!$A$20:$L$185,F$2,0)&\"\")","v":""},{"$f":"+IF($A36=\"\",\"\",VLOOKUP($A36,Table!$A$20:$L$185,G$2,0))","v":""},{"$f":"+IF($A36=\"\",\"\",VLOOKUP($A36,Table!$A$20:$L$185,H$2,0)&\"\")","v":""},null,{"$f":"+IF($A36=\"\",\"\",VLOOKUP($A36,Table!$A$20:$L$185,J$2,0))","v":""},{"$f":"+IF($A36=\"\",\"\",VLOOKUP($A36,Table!$A$20:$L$185,K$2,0))","v":""},{"$f":"+IF($A36=\"\",\"\",VLOOKUP($A36,Table!$A$20:$L$185,L$2,0))","v":""},null,{"$f":"+IF($A36=\"\",\"\",VLOOKUP($A36,Table!$A$20:$L$185,N$2,0))","v":""},null,{"$f":"+IF(AND($A36<>\"\",$O36=\"YES\"),COUNTIF($O$19:$O36,\"YES\")&\".YC\",\"\")","v":""},""]
[{"$f":"IF($B37=\"\",\"\",$B37&\".\" &COUNTIFS($B$20:$B37,$B37))","v":""},{"$f":"IF(AND($A$10=\"YES\", COUNTIFS($B$19:$B36,Table!$B$7)<Table!$B$5),Table!$B$7,IF(AND($C$10=\"YES\", COUNTIFS($B$19:$B36,Table!$C$7)<Table!$C$5),Table!$C$7, IF(AND($D$10=\"YES\", COUNTIFS($B$19:$B36,Table!$D$7)<Table!$D$5),Table!$D$7, IF(AND($E$10=\"YES\", COUNTIFS($B$19:$B36,Table!$E$7)<Table!$E$5),Table!$E$7, IF(AND($F$10=\"YES\", COUNTIFS($B$19:$B36,Table!$F$7)<Table!$F$5),Table!$F$7,\"\")))))","v":""},{"$f":"+IF($A37=\"\",\"\",VLOOKUP($A37,Table!$A$20:$L$185,C$2,0))","v":""},{"$f":"+IF($A37=\"\",\"\",VLOOKUP($A37,Table!$A$20:$L$185,D$2,0)&\"\")","v":""},{"$f":"+IF($A37=\"\",\"\",VLOOKUP($A37,Table!$A$20:$L$185,E$2,0))","v":""},{"$f":"+IF($A37=\"\",\"\",VLOOKUP($A37,Table!$A$20:$L$185,F$2,0)&\"\")","v":""},{"$f":"+IF($A37=\"\",\"\",VLOOKUP($A37,Table!$A$20:$L$185,G$2,0))","v":""},{"$f":"+IF($A37=\"\",\"\",VLOOKUP($A37,Table!$A$20:$L$185,H$2,0)&\"\")","v":""},null,{"$f":"+IF($A37=\"\",\"\",VLOOKUP($A37,Table!$A$20:$L$185,J$2,0))","v":""},{"$f":"+IF($A37=\"\",\"\",VLOOKUP($A37,Table!$A$20:$L$185,K$2,0))","v":""},{"$f":"+IF($A37=\"\",\"\",VLOOKUP($A37,Table!$A$20:$L$185,L$2,0))","v":""},null,{"$f":"+IF($A37=\"\",\"\",VLOOKUP($A37,Table!$A$20:$L$185,N$2,0))","v":""},null,{"$f":"+IF(AND($A37<>\"\",$O37=\"YES\"),COUNTIF($O$19:$O37,\"YES\")&\".YC\",\"\")","v":""},""]
[{"$f":"IF($B38=\"\",\"\",$B38&\".\" &COUNTIFS($B$20:$B38,$B38))","v":""},{"$f":"IF(AND($A$10=\"YES\", COUNTIFS($B$19:$B37,Table!$B$7)<Table!$B$5),Table!$B$7,IF(AND($C$10=\"YES\", COUNTIFS($B$19:$B37,Table!$C$7)<Table!$C$5),Table!$C$7, IF(AND($D$10=\"YES\", COUNTIFS($B$19:$B37,Table!$D$7)<Table!$D$5),Table!$D$7, IF(AND($E$10=\"YES\", COUNTIFS($B$19:$B37,Table!$E$7)<Table!$E$5),Table!$E$7, IF(AND($F$10=\"YES\", COUNTIFS($B$19:$B37,Table!$F$7)<Table!$F$5),Table!$F$7,\"\")))))","v":""},{"$f":"+IF($A38=\"\",\"\",VLOOKUP($A38,Table!$A$20:$L$185,C$2,0))","v":""},{"$f":"+IF($A38=\"\",\"\",VLOOKUP($A38,Table!$A$20:$L$185,D$2,0)&\"\")","v":""},{"$f":"+IF($A38=\"\",\"\",VLOOKUP($A38,Table!$A$20:$L$185,E$2,0))","v":""},{"$f":"+IF($A38=\"\",\"\",VLOOKUP($A38,Table!$A$20:$L$185,F$2,0)&\"\")","v":""},{"$f":"+IF($A38=\"\",\"\",VLOOKUP($A38,Table!$A$20:$L$185,G$2,0))","v":""},{"$f":"+IF($A38=\"\",\"\",VLOOKUP($A38,Table!$A$20:$L$185,H$2,0)&\"\")","v":""},null,{"$f":"+IF($A38=\"\",\"\",VLOOKUP($A38,Table!$A$20:$L$185,J$2,0))","v":""},{"$f":"+IF($A38=\"\",\"\",VLOOKUP($A38,Table!$A$20:$L$185,K$2,0))","v":""},{"$f":"+IF($A38=\"\",\"\",VLOOKUP($A38,Table!$A$20:$L$185,L$2,0))","v":""},null,{"$f":"+IF($A38=\"\",\"\",VLOOKUP($A38,Table!$A$20:$L$185,N$2,0))","v":""},null,{"$f":"+IF(AND($A38<>\"\",$O38=\"YES\"),COUNTIF($O$19:$O38,\"YES\")&\".YC\",\"\")","v":""},""]
[{"$f":"IF($B39=\"\",\"\",$B39&\".\" &COUNTIFS($B$20:$B39,$B39))","v":""},{"$f":"IF(AND($A$10=\"YES\", COUNTIFS($B$19:$B38,Table!$B$7)<Table!$B$5),Table!$B$7,IF(AND($C$10=\"YES\", COUNTIFS($B$19:$B38,Table!$C$7)<Table!$C$5),Table!$C$7, IF(AND($D$10=\"YES\", COUNTIFS($B$19:$B38,Table!$D$7)<Table!$D$5),Table!$D$7, IF(AND($E$10=\"YES\", COUNTIFS($B$19:$B38,Table!$E$7)<Table!$E$5),Table!$E$7, IF(AND($F$10=\"YES\", COUNTIFS($B$19:$B38,Table!$F$7)<Table!$F$5),Table!$F$7,\"\")))))","v":""},{"$f":"+IF($A39=\"\",\"\",VLOOKUP($A39,Table!$A$20:$L$185,C$2,0))","v":""},{"$f":"+IF($A39=\"\",\"\",VLOOKUP($A39,Table!$A$20:$L$185,D$2,0)&\"\")","v":""},{"$f":"+IF($A39=\"\",\"\",VLOOKUP($A39,Table!$A$20:$L$185,E$2,0))","v":""},{"$f":"+IF($A39=\"\",\"\",VLOOKUP($A39,Table!$A$20:$L$185,F$2,0)&\"\")","v":""},{"$f":"+IF($A39=\"\",\"\",VLOOKUP($A39,Table!$A$20:$L$185,G$2,0))","v":""},{"$f":"+IF($A39=\"\",\"\",VLOOKUP($A39,Table!$A$20:$L$185,H$2,0)&\"\")","v":""},null,{"$f":"+IF($A39=\"\",\"\",VLOOKUP($A39,Table!$A$20:$L$185,J$2,0))","v":""},{"$f":"+IF($A39=\"\",\"\",VLOOKUP($A39,Table!$A$20:$L$185,K$2,0))","v":""},{"$f":"+IF($A39=\"\",\"\",VLOOKUP($A39,Table!$A$20:$L$185,L$2,0))","v":""},null,{"$f":"+IF($A39=\"\",\"\",VLOOKUP($A39,Table!$A$20:$L$185,N$2,0))","v":""},null,{"$f":"+IF(AND($A39<>\"\",$O39=\"YES\"),COUNTIF($O$19:$O39,\"YES\")&\".YC\",\"\")","v":""},""]
[{"$f":"IF($B40=\"\",\"\",$B40&\".\" &COUNTIFS($B$20:$B40,$B40))","v":""},{"$f":"IF(AND($A$10=\"YES\", COUNTIFS($B$19:$B39,Table!$B$7)<Table!$B$5),Table!$B$7,IF(AND($C$10=\"YES\", COUNTIFS($B$19:$B39,Table!$C$7)<Table!$C$5),Table!$C$7, IF(AND($D$10=\"YES\", COUNTIFS($B$19:$B39,Table!$D$7)<Table!$D$5),Table!$D$7, IF(AND($E$10=\"YES\", COUNTIFS($B$19:$B39,Table!$E$7)<Table!$E$5),Table!$E$7, IF(AND($F$10=\"YES\", COUNTIFS($B$19:$B39,Table!$F$7)<Table!$F$5),Table!$F$7,\"\")))))","v":""},{"$f":"+IF($A40=\"\",\"\",VLOOKUP($A40,Table!$A$20:$L$185,C$2,0))","v":""},{"$f":"+IF($A40=\"\",\"\",VLOOKUP($A40,Table!$A$20:$L$185,D$2,0)&\"\")","v":""},{"$f":"+IF($A40=\"\",\"\",VLOOKUP($A40,Table!$A$20:$L$185,E$2,0))","v":""},{"$f":"+IF($A40=\"\",\"\",VLOOKUP($A40,Table!$A$20:$L$185,F$2,0)&\"\")","v":""},{"$f":"+IF($A40=\"\",\"\",VLOOKUP($A40,Table!$A$20:$L$185,G$2,0))","v":""},{"$f":"+IF($A40=\"\",\"\",VLOOKUP($A40,Table!$A$20:$L$185,H$2,0)&\"\")","v":""},null,{"$f":"+IF($A40=\"\",\"\",VLOOKUP($A40,Table!$A$20:$L$185,J$2,0))","v":""},{"$f":"+IF($A40=\"\",\"\",VLOOKUP($A40,Table!$A$20:$L$185,K$2,0))","v":""},{"$f":"+IF($A40=\"\",\"\",VLOOKUP($A40,Table!$A$20:$L$185,L$2,0))","v":""},null,{"$f":"+IF($A40=\"\",\"\",VLOOKUP($A40,Table!$A$20:$L$185,N$2,0))","v":""},null,{"$f":"+IF(AND($A40<>\"\",$O40=\"YES\"),COUNTIF($O$19:$O40,\"YES\")&\".YC\",\"\")","v":""},"",{"$f":"+P40","v":""},{"$f":"+Q40","v":""}]
[{"$f":"IF($B41=\"\",\"\",$B41&\".\" &COUNTIFS($B$20:$B41,$B41))","v":""},{"$f":"IF(AND($A$10=\"YES\", COUNTIFS($B$19:$B40,Table!$B$7)<Table!$B$5),Table!$B$7,IF(AND($C$10=\"YES\", COUNTIFS($B$19:$B40,Table!$C$7)<Table!$C$5),Table!$C$7, IF(AND($D$10=\"YES\", COUNTIFS($B$19:$B40,Table!$D$7)<Table!$D$5),Table!$D$7, IF(AND($E$10=\"YES\", COUNTIFS($B$19:$B40,Table!$E$7)<Table!$E$5),Table!$E$7, IF(AND($F$10=\"YES\", COUNTIFS($B$19:$B40,Table!$F$7)<Table!$F$5),Table!$F$7,\"\")))))","v":""},{"$f":"+IF($A41=\"\",\"\",VLOOKUP($A41,Table!$A$20:$L$185,C$2,0))","v":""},{"$f":"+IF($A41=\"\",\"\",VLOOKUP($A41,Table!$A$20:$L$185,D$2,0)&\"\")","v":""},{"$f":"+IF($A41=\"\",\"\",VLOOKUP($A41,Table!$A$20:$L$185,E$2,0))","v":""},{"$f":"+IF($A41=\"\",\"\",VLOOKUP($A41,Table!$A$20:$L$185,F$2,0)&\"\")","v":""},{"$f":"+IF($A41=\"\",\"\",VLOOKUP($A41,Table!$A$20:$L$185,G$2,0))","v":""},{"$f":"+IF($A41=\"\",\"\",VLOOKUP($A41,Table!$A$20:$L$185,H$2,0)&\"\")","v":""},null,{"$f":"+IF($A41=\"\",\"\",VLOOKUP($A41,Table!$A$20:$L$185,J$2,0))","v":""},{"$f":"+IF($A41=\"\",\"\",VLOOKUP($A41,Table!$A$20:$L$185,K$2,0))","v":""},{"$f":"+IF($A41=\"\",\"\",VLOOKUP($A41,Table!$A$20:$L$185,L$2,0))","v":""},null,{"$f":"+IF($A41=\"\",\"\",VLOOKUP($A41,Table!$A$20:$L$185,N$2,0))","v":""},null,{"$f":"+IF(AND($A41<>\"\",$O41=\"YES\"),COUNTIF($O$19:$O41,\"YES\")&\".YC\",\"\")","v":""},""]
[{"$f":"IF($B42=\"\",\"\",$B42&\".\" &COUNTIFS($B$20:$B42,$B42))","v":""},{"$f":"IF(AND($A$10=\"YES\", COUNTIFS($B$19:$B41,Table!$B$7)<Table!$B$5),Table!$B$7,IF(AND($C$10=\"YES\", COUNTIFS($B$19:$B41,Table!$C$7)<Table!$C$5),Table!$C$7, IF(AND($D$10=\"YES\", COUNTIFS($B$19:$B41,Table!$D$7)<Table!$D$5),Table!$D$7, IF(AND($E$10=\"YES\", COUNTIFS($B$19:$B41,Table!$E$7)<Table!$E$5),Table!$E$7, IF(AND($F$10=\"YES\", COUNTIFS($B$19:$B41,Table!$F$7)<Table!$F$5),Table!$F$7,\"\")))))","v":""},{"$f":"+IF($A42=\"\",\"\",VLOOKUP($A42,Table!$A$20:$L$185,C$2,0))","v":""},{"$f":"+IF($A42=\"\",\"\",VLOOKUP($A42,Table!$A$20:$L$185,D$2,0)&\"\")","v":""},{"$f":"+IF($A42=\"\",\"\",VLOOKUP($A42,Table!$A$20:$L$185,E$2,0))","v":""},{"$f":"+IF($A42=\"\",\"\",VLOOKUP($A42,Table!$A$20:$L$185,F$2,0)&\"\")","v":""},{"$f":"+IF($A42=\"\",\"\",VLOOKUP($A42,Table!$A$20:$L$185,G$2,0))","v":""},{"$f":"+IF($A42=\"\",\"\",VLOOKUP($A42,Table!$A$20:$L$185,H$2,0)&\"\")","v":""},null,{"$f":"+IF($A42=\"\",\"\",VLOOKUP($A42,Table!$A$20:$L$185,J$2,0))","v":""},{"$f":"+IF($A42=\"\",\"\",VLOOKUP($A42,Table!$A$20:$L$185,K$2,0))","v":""},{"$f":"+IF($A42=\"\",\"\",VLOOKUP($A42,Table!$A$20:$L$185,L$2,0))","v":""},null,{"$f":"+IF($A42=\"\",\"\",VLOOKUP($A42,Table!$A$20:$L$185,N$2,0))","v":""},null,{"$f":"+IF(AND($A42<>\"\",$O42=\"YES\"),COUNTIF($O$19:$O42,\"YES\")&\".YC\",\"\")","v":""},""]
[{"$f":"IF($B43=\"\",\"\",$B43&\".\" &COUNTIFS($B$20:$B43,$B43))","v":""},{"$f":"IF(AND($A$10=\"YES\", COUNTIFS($B$19:$B42,Table!$B$7)<Table!$B$5),Table!$B$7,IF(AND($C$10=\"YES\", COUNTIFS($B$19:$B42,Table!$C$7)<Table!$C$5),Table!$C$7, IF(AND($D$10=\"YES\", COUNTIFS($B$19:$B42,Table!$D$7)<Table!$D$5),Table!$D$7, IF(AND($E$10=\"YES\", COUNTIFS($B$19:$B42,Table!$E$7)<Table!$E$5),Table!$E$7, IF(AND($F$10=\"YES\", COUNTIFS($B$19:$B42,Table!$F$7)<Table!$F$5),Table!$F$7,\"\")))))","v":""},{"$f":"+IF($A43=\"\",\"\",VLOOKUP($A43,Table!$A$20:$L$185,C$2,0))","v":""},{"$f":"+IF($A43=\"\",\"\",VLOOKUP($A43,Table!$A$20:$L$185,D$2,0)&\"\")","v":""},{"$f":"+IF($A43=\"\",\"\",VLOOKUP($A43,Table!$A$20:$L$185,E$2,0))","v":""},{"$f":"+IF($A43=\"\",\"\",VLOOKUP($A43,Table!$A$20:$L$185,F$2,0)&\"\")","v":""},{"$f":"+IF($A43=\"\",\"\",VLOOKUP($A43,Table!$A$20:$L$185,G$2,0))","v":""},{"$f":"+IF($A43=\"\",\"\",VLOOKUP($A43,Table!$A$20:$L$185,H$2,0)&\"\")","v":""},null,{"$f":"+IF($A43=\"\",\"\",VLOOKUP($A43,Table!$A$20:$L$185,J$2,0))","v":""},{"$f":"+IF($A43=\"\",\"\",VLOOKUP($A43,Table!$A$20:$L$185,K$2,0))","v":""},{"$f":"+IF($A43=\"\",\"\",VLOOKUP($A43,Table!$A$20:$L$185,L$2,0))","v":""},null,{"$f":"+IF($A43=\"\",\"\",VLOOKUP($A43,Table!$A$20:$L$185,N$2,0))","v":""},null,{"$f":"+IF(AND($A43<>\"\",$O43=\"YES\"),COUNTIF($O$19:$O43,\"YES\")&\".YC\",\"\")","v":""},""]
[{"$f":"IF($B44=\"\",\"\",$B44&\".\" &COUNTIFS($B$20:$B44,$B44))","v":""},{"$f":"IF(AND($A$10=\"YES\", COUNTIFS($B$19:$B43,Table!$B$7)<Table!$B$5),Table!$B$7,IF(AND($C$10=\"YES\", COUNTIFS($B$19:$B43,Table!$C$7)<Table!$C$5),Table!$C$7, IF(AND($D$10=\"YES\", COUNTIFS($B$19:$B43,Table!$D$7)<Table!$D$5),Table!$D$7, IF(AND($E$10=\"YES\", COUNTIFS($B$19:$B43,Table!$E$7)<Table!$E$5),Table!$E$7, IF(AND($F$10=\"YES\", COUNTIFS($B$19:$B43,Table!$F$7)<Table!$F$5),Table!$F$7,\"\")))))","v":""},{"$f":"+IF($A44=\"\",\"\",VLOOKUP($A44,Table!$A$20:$L$185,C$2,0))","v":""},{"$f":"+IF($A44=\"\",\"\",VLOOKUP($A44,Table!$A$20:$L$185,D$2,0)&\"\")","v":""},{"$f":"+IF($A44=\"\",\"\",VLOOKUP($A44,Table!$A$20:$L$185,E$2,0))","v":""},{"$f":"+IF($A44=\"\",\"\",VLOOKUP($A44,Table!$A$20:$L$185,F$2,0)&\"\")","v":""},{"$f":"+IF($A44=\"\",\"\",VLOOKUP($A44,Table!$A$20:$L$185,G$2,0))","v":""},{"$f":"+IF($A44=\"\",\"\",VLOOKUP($A44,Table!$A$20:$L$185,H$2,0)&\"\")","v":""},null,{"$f":"+IF($A44=\"\",\"\",VLOOKUP($A44,Table!$A$20:$L$185,J$2,0))","v":""},{"$f":"+IF($A44=\"\",\"\",VLOOKUP($A44,Table!$A$20:$L$185,K$2,0))","v":""},{"$f":"+IF($A44=\"\",\"\",VLOOKUP($A44,Table!$A$20:$L$185,L$2,0))","v":""},null,{"$f":"+IF($A44=\"\",\"\",VLOOKUP($A44,Table!$A$20:$L$185,N$2,0))","v":""},null,{"$f":"+IF(AND($A44<>\"\",$O44=\"YES\"),COUNTIF($O$19:$O44,\"YES\")&\".YC\",\"\")","v":""},""]
[{"$f":"IF($B45=\"\",\"\",$B45&\".\" &COUNTIFS($B$20:$B45,$B45))","v":""},{"$f":"IF(AND($A$10=\"YES\", COUNTIFS($B$19:$B44,Table!$B$7)<Table!$B$5),Table!$B$7,IF(AND($C$10=\"YES\", COUNTIFS($B$19:$B44,Table!$C$7)<Table!$C$5),Table!$C$7, IF(AND($D$10=\"YES\", COUNTIFS($B$19:$B44,Table!$D$7)<Table!$D$5),Table!$D$7, IF(AND($E$10=\"YES\", COUNTIFS($B$19:$B44,Table!$E$7)<Table!$E$5),Table!$E$7, IF(AND($F$10=\"YES\", COUNTIFS($B$19:$B44,Table!$F$7)<Table!$F$5),Table!$F$7,\"\")))))","v":""},{"$f":"+IF($A45=\"\",\"\",VLOOKUP($A45,Table!$A$20:$L$185,C$2,0))","v":""},{"$f":"+IF($A45=\"\",\"\",VLOOKUP($A45,Table!$A$20:$L$185,D$2,0)&\"\")","v":""},{"$f":"+IF($A45=\"\",\"\",VLOOKUP($A45,Table!$A$20:$L$185,E$2,0))","v":""},{"$f":"+IF($A45=\"\",\"\",VLOOKUP($A45,Table!$A$20:$L$185,F$2,0)&\"\")","v":""},{"$f":"+IF($A45=\"\",\"\",VLOOKUP($A45,Table!$A$20:$L$185,G$2,0))","v":""},{"$f":"+IF($A45=\"\",\"\",VLOOKUP($A45,Table!$A$20:$L$185,H$2,0)&\"\")","v":""},null,{"$f":"+IF($A45=\"\",\"\",VLOOKUP($A45,Table!$A$20:$L$185,J$2,0))","v":""},{"$f":"+IF($A45=\"\",\"\",VLOOKUP($A45,Table!$A$20:$L$185,K$2,0))","v":""},{"$f":"+IF($A45=\"\",\"\",VLOOKUP($A45,Table!$A$20:$L$185,L$2,0))","v":""},null,{"$f":"+IF($A45=\"\",\"\",VLOOKUP($A45,Table!$A$20:$L$185,N$2,0))","v":""},null,{"$f":"+IF(AND($A45<>\"\",$O45=\"YES\"),COUNTIF($O$19:$O45,\"YES\")&\".YC\",\"\")","v":""},""]
[{"$f":"IF($B46=\"\",\"\",$B46&\".\" &COUNTIFS($B$20:$B46,$B46))","v":""},{"$f":"IF(AND($A$10=\"YES\", COUNTIFS($B$19:$B45,Table!$B$7)<Table!$B$5),Table!$B$7,IF(AND($C$10=\"YES\", COUNTIFS($B$19:$B45,Table!$C$7)<Table!$C$5),Table!$C$7, IF(AND($D$10=\"YES\", COUNTIFS($B$19:$B45,Table!$D$7)<Table!$D$5),Table!$D$7, IF(AND($E$10=\"YES\", COUNTIFS($B$19:$B45,Table!$E$7)<Table!$E$5),Table!$E$7, IF(AND($F$10=\"YES\", COUNTIFS($B$19:$B45,Table!$F$7)<Table!$F$5),Table!$F$7,\"\")))))","v":""},{"$f":"+IF($A46=\"\",\"\",VLOOKUP($A46,Table!$A$20:$L$185,C$2,0))","v":""},{"$f":"+IF($A46=\"\",\"\",VLOOKUP($A46,Table!$A$20:$L$185,D$2,0)&\"\")","v":""},{"$f":"+IF($A46=\"\",\"\",VLOOKUP($A46,Table!$A$20:$L$185,E$2,0))","v":""},{"$f":"+IF($A46=\"\",\"\",VLOOKUP($A46,Table!$A$20:$L$185,F$2,0)&\"\")","v":""},{"$f":"+IF($A46=\"\",\"\",VLOOKUP($A46,Table!$A$20:$L$185,G$2,0))","v":""},{"$f":"+IF($A46=\"\",\"\",VLOOKUP($A46,Table!$A$20:$L$185,H$2,0)&\"\")","v":""},null,{"$f":"+IF($A46=\"\",\"\",VLOOKUP($A46,Table!$A$20:$L$185,J$2,0))","v":""},{"$f":"+IF($A46=\"\",\"\",VLOOKUP($A46,Table!$A$20:$L$185,K$2,0))","v":""},{"$f":"+IF($A46=\"\",\"\",VLOOKUP($A46,Table!$A$20:$L$185,L$2,0))","v":""},null,{"$f":"+IF($A46=\"\",\"\",VLOOKUP($A46,Table!$A$20:$L$185,N$2,0))","v":""},null,{"$f":"+IF(AND($A46<>\"\",$O46=\"YES\"),COUNTIF($O$19:$O46,\"YES\")&\".YC\",\"\")","v":""},""]
[{"$f":"IF($B47=\"\",\"\",$B47&\".\" &COUNTIFS($B$20:$B47,$B47))","v":""},{"$f":"IF(AND($A$10=\"YES\", COUNTIFS($B$19:$B46,Table!$B$7)<Table!$B$5),Table!$B$7,IF(AND($C$10=\"YES\", COUNTIFS($B$19:$B46,Table!$C$7)<Table!$C$5),Table!$C$7, IF(AND($D$10=\"YES\", COUNTIFS($B$19:$B46,Table!$D$7)<Table!$D$5),Table!$D$7, IF(AND($E$10=\"YES\", COUNTIFS($B$19:$B46,Table!$E$7)<Table!$E$5),Table!$E$7, IF(AND($F$10=\"YES\", COUNTIFS($B$19:$B46,Table!$F$7)<Table!$F$5),Table!$F$7,\"\")))))","v":""},{"$f":"+IF($A47=\"\",\"\",VLOOKUP($A47,Table!$A$20:$L$185,C$2,0))","v":""},{"$f":"+IF($A47=\"\",\"\",VLOOKUP($A47,Table!$A$20:$L$185,D$2,0)&\"\")","v":""},{"$f":"+IF($A47=\"\",\"\",VLOOKUP($A47,Table!$A$20:$L$185,E$2,0))","v":""},{"$f":"+IF($A47=\"\",\"\",VLOOKUP($A47,Table!$A$20:$L$185,F$2,0)&\"\")","v":""},{"$f":"+IF($A47=\"\",\"\",VLOOKUP($A47,Table!$A$20:$L$185,G$2,0))","v":""},{"$f":"+IF($A47=\"\",\"\",VLOOKUP($A47,Table!$A$20:$L$185,H$2,0)&\"\")","v":""},null,{"$f":"+IF($A47=\"\",\"\",VLOOKUP($A47,Table!$A$20:$L$185,J$2,0))","v":""},{"$f":"+IF($A47=\"\",\"\",VLOOKUP($A47,Table!$A$20:$L$185,K$2,0))","v":""},{"$f":"+IF($A47=\"\",\"\",VLOOKUP($A47,Table!$A$20:$L$185,L$2,0))","v":""},null,{"$f":"+IF($A47=\"\",\"\",VLOOKUP($A47,Table!$A$20:$L$185,N$2,0))","v":""},null,{"$f":"+IF(AND($A47<>\"\",$O47=\"YES\"),COUNTIF($O$19:$O47,\"YES\")&\".YC\",\"\")","v":""},""]
[{"$f":"IF($B48=\"\",\"\",$B48&\".\" &COUNTIFS($B$20:$B48,$B48))","v":""},{"$f":"IF(AND($A$10=\"YES\", COUNTIFS($B$19:$B47,Table!$B$7)<Table!$B$5),Table!$B$7,IF(AND($C$10=\"YES\", COUNTIFS($B$19:$B47,Table!$C$7)<Table!$C$5),Table!$C$7, IF(AND($D$10=\"YES\", COUNTIFS($B$19:$B47,Table!$D$7)<Table!$D$5),Table!$D$7, IF(AND($E$10=\"YES\", COUNTIFS($B$19:$B47,Table!$E$7)<Table!$E$5),Table!$E$7, IF(AND($F$10=\"YES\", COUNTIFS($B$19:$B47,Table!$F$7)<Table!$F$5),Table!$F$7,\"\")))))","v":""},{"$f":"+IF($A48=\"\",\"\",VLOOKUP($A48,Table!$A$20:$L$185,C$2,0))","v":""},{"$f":"+IF($A48=\"\",\"\",VLOOKUP($A48,Table!$A$20:$L$185,D$2,0)&\"\")","v":""},{"$f":"+IF($A48=\"\",\"\",VLOOKUP($A48,Table!$A$20:$L$185,E$2,0))","v":""},{"$f":"+IF($A48=\"\",\"\",VLOOKUP($A48,Table!$A$20:$L$185,F$2,0)&\"\")","v":""},{"$f":"+IF($A48=\"\",\"\",VLOOKUP($A48,Table!$A$20:$L$185,G$2,0))","v":""},{"$f":"+IF($A48=\"\",\"\",VLOOKUP($A48,Table!$A$20:$L$185,H$2,0)&\"\")","v":""},null,{"$f":"+IF($A48=\"\",\"\",VLOOKUP($A48,Table!$A$20:$L$185,J$2,0))","v":""},{"$f":"+IF($A48=\"\",\"\",VLOOKUP($A48,Table!$A$20:$L$185,K$2,0))","v":""},{"$f":"+IF($A48=\"\",\"\",VLOOKUP($A48,Table!$A$20:$L$185,L$2,0))","v":""},null,{"$f":"+IF($A48=\"\",\"\",VLOOKUP($A48,Table!$A$20:$L$185,N$2,0))","v":""},null,{"$f":"+IF(AND($A48<>\"\",$O48=\"YES\"),COUNTIF($O$19:$O48,\"YES\")&\".YC\",\"\")","v":""},""]
[{"$f":"IF($B49=\"\",\"\",$B49&\".\" &COUNTIFS($B$20:$B49,$B49))","v":""},{"$f":"IF(AND($A$10=\"YES\", COUNTIFS($B$19:$B48,Table!$B$7)<Table!$B$5),Table!$B$7,IF(AND($C$10=\"YES\", COUNTIFS($B$19:$B48,Table!$C$7)<Table!$C$5),Table!$C$7, IF(AND($D$10=\"YES\", COUNTIFS($B$19:$B48,Table!$D$7)<Table!$D$5),Table!$D$7, IF(AND($E$10=\"YES\", COUNTIFS($B$19:$B48,Table!$E$7)<Table!$E$5),Table!$E$7, IF(AND($F$10=\"YES\", COUNTIFS($B$19:$B48,Table!$F$7)<Table!$F$5),Table!$F$7,\"\")))))","v":""},{"$f":"+IF($A49=\"\",\"\",VLOOKUP($A49,Table!$A$20:$L$185,C$2,0))","v":""},{"$f":"+IF($A49=\"\",\"\",VLOOKUP($A49,Table!$A$20:$L$185,D$2,0)&\"\")","v":""},{"$f":"+IF($A49=\"\",\"\",VLOOKUP($A49,Table!$A$20:$L$185,E$2,0))","v":""},{"$f":"+IF($A49=\"\",\"\",VLOOKUP($A49,Table!$A$20:$L$185,F$2,0)&\"\")","v":""},{"$f":"+IF($A49=\"\",\"\",VLOOKUP($A49,Table!$A$20:$L$185,G$2,0))","v":""},{"$f":"+IF($A49=\"\",\"\",VLOOKUP($A49,Table!$A$20:$L$185,H$2,0)&\"\")","v":""},null,{"$f":"+IF($A49=\"\",\"\",VLOOKUP($A49,Table!$A$20:$L$185,J$2,0))","v":""},{"$f":"+IF($A49=\"\",\"\",VLOOKUP($A49,Table!$A$20:$L$185,K$2,0))","v":""},{"$f":"+IF($A49=\"\",\"\",VLOOKUP($A49,Table!$A$20:$L$185,L$2,0))","v":""},null,{"$f":"+IF($A49=\"\",\"\",VLOOKUP($A49,Table!$A$20:$L$185,N$2,0))","v":""},null,{"$f":"+IF(AND($A49<>\"\",$O49=\"YES\"),COUNTIF($O$19:$O49,\"YES\")&\".YC\",\"\")","v":""},""]
[{"$f":"IF($B50=\"\",\"\",$B50&\".\" &COUNTIFS($B$20:$B50,$B50))","v":""},{"$f":"IF(AND($A$10=\"YES\", COUNTIFS($B$19:$B49,Table!$B$7)<Table!$B$5),Table!$B$7,IF(AND($C$10=\"YES\", COUNTIFS($B$19:$B49,Table!$C$7)<Table!$C$5),Table!$C$7, IF(AND($D$10=\"YES\", COUNTIFS($B$19:$B49,Table!$D$7)<Table!$D$5),Table!$D$7, IF(AND($E$10=\"YES\", COUNTIFS($B$19:$B49,Table!$E$7)<Table!$E$5),Table!$E$7, IF(AND($F$10=\"YES\", COUNTIFS($B$19:$B49,Table!$F$7)<Table!$F$5),Table!$F$7,\"\")))))","v":""},{"$f":"+IF($A50=\"\",\"\",VLOOKUP($A50,Table!$A$20:$L$185,C$2,0))","v":""},{"$f":"+IF($A50=\"\",\"\",VLOOKUP($A50,Table!$A$20:$L$185,D$2,0)&\"\")","v":""},{"$f":"+IF($A50=\"\",\"\",VLOOKUP($A50,Table!$A$20:$L$185,E$2,0))","v":""},{"$f":"+IF($A50=\"\",\"\",VLOOKUP($A50,Table!$A$20:$L$185,F$2,0)&\"\")","v":""},{"$f":"+IF($A50=\"\",\"\",VLOOKUP($A50,Table!$A$20:$L$185,G$2,0))","v":""},{"$f":"+IF($A50=\"\",\"\",VLOOKUP($A50,Table!$A$20:$L$185,H$2,0)&\"\")","v":""},null,{"$f":"+IF($A50=\"\",\"\",VLOOKUP($A50,Table!$A$20:$L$185,J$2,0))","v":""},{"$f":"+IF($A50=\"\",\"\",VLOOKUP($A50,Table!$A$20:$L$185,K$2,0))","v":""},{"$f":"+IF($A50=\"\",\"\",VLOOKUP($A50,Table!$A$20:$L$185,L$2,0))","v":""},null,{"$f":"+IF($A50=\"\",\"\",VLOOKUP($A50,Table!$A$20:$L$185,N$2,0))","v":""},null,{"$f":"+IF(AND($A50<>\"\",$O50=\"YES\"),COUNTIF($O$19:$O50,\"YES\")&\".YC\",\"\")","v":""},""]
[{"$f":"IF($B51=\"\",\"\",$B51&\".\" &COUNTIFS($B$20:$B51,$B51))","v":""},{"$f":"IF(AND($A$10=\"YES\", COUNTIFS($B$19:$B50,Table!$B$7)<Table!$B$5),Table!$B$7,IF(AND($C$10=\"YES\", COUNTIFS($B$19:$B50,Table!$C$7)<Table!$C$5),Table!$C$7, IF(AND($D$10=\"YES\", COUNTIFS($B$19:$B50,Table!$D$7)<Table!$D$5),Table!$D$7, IF(AND($E$10=\"YES\", COUNTIFS($B$19:$B50,Table!$E$7)<Table!$E$5),Table!$E$7, IF(AND($F$10=\"YES\", COUNTIFS($B$19:$B50,Table!$F$7)<Table!$F$5),Table!$F$7,\"\")))))","v":""},{"$f":"+IF($A51=\"\",\"\",VLOOKUP($A51,Table!$A$20:$L$185,C$2,0))","v":""},{"$f":"+IF($A51=\"\",\"\",VLOOKUP($A51,Table!$A$20:$L$185,D$2,0)&\"\")","v":""},{"$f":"+IF($A51=\"\",\"\",VLOOKUP($A51,Table!$A$20:$L$185,E$2,0))","v":""},{"$f":"+IF($A51=\"\",\"\",VLOOKUP($A51,Table!$A$20:$L$185,F$2,0)&\"\")","v":""},{"$f":"+IF($A51=\"\",\"\",VLOOKUP($A51,Table!$A$20:$L$185,G$2,0))","v":""},{"$f":"+IF($A51=\"\",\"\",VLOOKUP($A51,Table!$A$20:$L$185,H$2,0)&\"\")","v":""},null,{"$f":"+IF($A51=\"\",\"\",VLOOKUP($A51,Table!$A$20:$L$185,J$2,0))","v":""},{"$f":"+IF($A51=\"\",\"\",VLOOKUP($A51,Table!$A$20:$L$185,K$2,0))","v":""},{"$f":"+IF($A51=\"\",\"\",VLOOKUP($A51,Table!$A$20:$L$185,L$2,0))","v":""},null,{"$f":"+IF($A51=\"\",\"\",VLOOKUP($A51,Table!$A$20:$L$185,N$2,0))","v":""},null,{"$f":"+IF(AND($A51<>\"\",$O51=\"YES\"),COUNTIF($O$19:$O51,\"YES\")&\".YC\",\"\")","v":""},""]
[{"$f":"IF($B52=\"\",\"\",$B52&\".\" &COUNTIFS($B$20:$B52,$B52))","v":""},{"$f":"IF(AND($A$10=\"YES\", COUNTIFS($B$19:$B51,Table!$B$7)<Table!$B$5),Table!$B$7,IF(AND($C$10=\"YES\", COUNTIFS($B$19:$B51,Table!$C$7)<Table!$C$5),Table!$C$7, IF(AND($D$10=\"YES\", COUNTIFS($B$19:$B51,Table!$D$7)<Table!$D$5),Table!$D$7, IF(AND($E$10=\"YES\", COUNTIFS($B$19:$B51,Table!$E$7)<Table!$E$5),Table!$E$7, IF(AND($F$10=\"YES\", COUNTIFS($B$19:$B51,Table!$F$7)<Table!$F$5),Table!$F$7,\"\")))))","v":""},{"$f":"+IF($A52=\"\",\"\",VLOOKUP($A52,Table!$A$20:$L$185,C$2,0))","v":""},{"$f":"+IF($A52=\"\",\"\",VLOOKUP($A52,Table!$A$20:$L$185,D$2,0)&\"\")","v":""},{"$f":"+IF($A52=\"\",\"\",VLOOKUP($A52,Table!$A$20:$L$185,E$2,0))","v":""},{"$f":"+IF($A52=\"\",\"\",VLOOKUP($A52,Table!$A$20:$L$185,F$2,0)&\"\")","v":""},{"$f":"+IF($A52=\"\",\"\",VLOOKUP($A52,Table!$A$20:$L$185,G$2,0))","v":""},{"$f":"+IF($A52=\"\",\"\",VLOOKUP($A52,Table!$A$20:$L$185,H$2,0)&\"\")","v":""},null,{"$f":"+IF($A52=\"\",\"\",VLOOKUP($A52,Table!$A$20:$L$185,J$2,0))","v":""},{"$f":"+IF($A52=\"\",\"\",VLOOKUP($A52,Table!$A$20:$L$185,K$2,0))","v":""},{"$f":"+IF($A52=\"\",\"\",VLOOKUP($A52,Table!$A$20:$L$185,L$2,0))","v":""},null,{"$f":"+IF($A52=\"\",\"\",VLOOKUP($A52,Table!$A$20:$L$185,N$2,0))","v":""},null,{"$f":"+IF(AND($A52<>\"\",$O52=\"YES\"),COUNTIF($O$19:$O52,\"YES\")&\".YC\",\"\")","v":""},""]
[{"$f":"IF($B53=\"\",\"\",$B53&\".\" &COUNTIFS($B$20:$B53,$B53))","v":""},{"$f":"IF(AND($A$10=\"YES\", COUNTIFS($B$19:$B52,Table!$B$7)<Table!$B$5),Table!$B$7,IF(AND($C$10=\"YES\", COUNTIFS($B$19:$B52,Table!$C$7)<Table!$C$5),Table!$C$7, IF(AND($D$10=\"YES\", COUNTIFS($B$19:$B52,Table!$D$7)<Table!$D$5),Table!$D$7, IF(AND($E$10=\"YES\", COUNTIFS($B$19:$B52,Table!$E$7)<Table!$E$5),Table!$E$7, IF(AND($F$10=\"YES\", COUNTIFS($B$19:$B52,Table!$F$7)<Table!$F$5),Table!$F$7,\"\")))))","v":""},{"$f":"+IF($A53=\"\",\"\",VLOOKUP($A53,Table!$A$20:$L$185,C$2,0))","v":""},{"$f":"+IF($A53=\"\",\"\",VLOOKUP($A53,Table!$A$20:$L$185,D$2,0)&\"\")","v":""},{"$f":"+IF($A53=\"\",\"\",VLOOKUP($A53,Table!$A$20:$L$185,E$2,0))","v":""},{"$f":"+IF($A53=\"\",\"\",VLOOKUP($A53,Table!$A$20:$L$185,F$2,0)&\"\")","v":""},{"$f":"+IF($A53=\"\",\"\",VLOOKUP($A53,Table!$A$20:$L$185,G$2,0))","v":""},{"$f":"+IF($A53=\"\",\"\",VLOOKUP($A53,Table!$A$20:$L$185,H$2,0)&\"\")","v":""},null,{"$f":"+IF($A53=\"\",\"\",VLOOKUP($A53,Table!$A$20:$L$185,J$2,0))","v":""},{"$f":"+IF($A53=\"\",\"\",VLOOKUP($A53,Table!$A$20:$L$185,K$2,0))","v":""},{"$f":"+IF($A53=\"\",\"\",VLOOKUP($A53,Table!$A$20:$L$185,L$2,0))","v":""},null,{"$f":"+IF($A53=\"\",\"\",VLOOKUP($A53,Table!$A$20:$L$185,N$2,0))","v":""},null,{"$f":"+IF(AND($A53<>\"\",$O53=\"YES\"),COUNTIF($O$19:$O53,\"YES\")&\".YC\",\"\")","v":""},""]
[{"$f":"IF($B54=\"\",\"\",$B54&\".\" &COUNTIFS($B$20:$B54,$B54))","v":""},{"$f":"IF(AND($A$10=\"YES\", COUNTIFS($B$19:$B53,Table!$B$7)<Table!$B$5),Table!$B$7,IF(AND($C$10=\"YES\", COUNTIFS($B$19:$B53,Table!$C$7)<Table!$C$5),Table!$C$7, IF(AND($D$10=\"YES\", COUNTIFS($B$19:$B53,Table!$D$7)<Table!$D$5),Table!$D$7, IF(AND($E$10=\"YES\", COUNTIFS($B$19:$B53,Table!$E$7)<Table!$E$5),Table!$E$7, IF(AND($F$10=\"YES\", COUNTIFS($B$19:$B53,Table!$F$7)<Table!$F$5),Table!$F$7,\"\")))))","v":""},{"$f":"+IF($A54=\"\",\"\",VLOOKUP($A54,Table!$A$20:$L$185,C$2,0))","v":""},{"$f":"+IF($A54=\"\",\"\",VLOOKUP($A54,Table!$A$20:$L$185,D$2,0)&\"\")","v":""},{"$f":"+IF($A54=\"\",\"\",VLOOKUP($A54,Table!$A$20:$L$185,E$2,0))","v":""},{"$f":"+IF($A54=\"\",\"\",VLOOKUP($A54,Table!$A$20:$L$185,F$2,0)&\"\")","v":""},{"$f":"+IF($A54=\"\",\"\",VLOOKUP($A54,Table!$A$20:$L$185,G$2,0))","v":""},{"$f":"+IF($A54=\"\",\"\",VLOOKUP($A54,Table!$A$20:$L$185,H$2,0)&\"\")","v":""},null,{"$f":"+IF($A54=\"\",\"\",VLOOKUP($A54,Table!$A$20:$L$185,J$2,0))","v":""},{"$f":"+IF($A54=\"\",\"\",VLOOKUP($A54,Table!$A$20:$L$185,K$2,0))","v":""},{"$f":"+IF($A54=\"\",\"\",VLOOKUP($A54,Table!$A$20:$L$185,L$2,0))","v":""},null,{"$f":"+IF($A54=\"\",\"\",VLOOKUP($A54,Table!$A$20:$L$185,N$2,0))","v":""},null,{"$f":"+IF(AND($A54<>\"\",$O54=\"YES\"),COUNTIF($O$19:$O54,\"YES\")&\".YC\",\"\")","v":""},""]
[{"$f":"IF($B55=\"\",\"\",$B55&\".\" &COUNTIFS($B$20:$B55,$B55))","v":""},{"$f":"IF(AND($A$10=\"YES\", COUNTIFS($B$19:$B54,Table!$B$7)<Table!$B$5),Table!$B$7,IF(AND($C$10=\"YES\", COUNTIFS($B$19:$B54,Table!$C$7)<Table!$C$5),Table!$C$7, IF(AND($D$10=\"YES\", COUNTIFS($B$19:$B54,Table!$D$7)<Table!$D$5),Table!$D$7, IF(AND($E$10=\"YES\", COUNTIFS($B$19:$B54,Table!$E$7)<Table!$E$5),Table!$E$7, IF(AND($F$10=\"YES\", COUNTIFS($B$19:$B54,Table!$F$7)<Table!$F$5),Table!$F$7,\"\")))))","v":""},{"$f":"+IF($A55=\"\",\"\",VLOOKUP($A55,Table!$A$20:$L$185,C$2,0))","v":""},{"$f":"+IF($A55=\"\",\"\",VLOOKUP($A55,Table!$A$20:$L$185,D$2,0)&\"\")","v":""},{"$f":"+IF($A55=\"\",\"\",VLOOKUP($A55,Table!$A$20:$L$185,E$2,0))","v":""},{"$f":"+IF($A55=\"\",\"\",VLOOKUP($A55,Table!$A$20:$L$185,F$2,0)&\"\")","v":""},{"$f":"+IF($A55=\"\",\"\",VLOOKUP($A55,Table!$A$20:$L$185,G$2,0))","v":""},{"$f":"+IF($A55=\"\",\"\",VLOOKUP($A55,Table!$A$20:$L$185,H$2,0)&\"\")","v":""},null,{"$f":"+IF($A55=\"\",\"\",VLOOKUP($A55,Table!$A$20:$L$185,J$2,0))","v":""},{"$f":"+IF($A55=\"\",\"\",VLOOKUP($A55,Table!$A$20:$L$185,K$2,0))","v":""},{"$f":"+IF($A55=\"\",\"\",VLOOKUP($A55,Table!$A$20:$L$185,L$2,0))","v":""},null,{"$f":"+IF($A55=\"\",\"\",VLOOKUP($A55,Table!$A$20:$L$185,N$2,0))","v":""},null,{"$f":"+IF(AND($A55<>\"\",$O55=\"YES\"),COUNTIF($O$19:$O55,\"YES\")&\".YC\",\"\")","v":""},""]
[{"$f":"IF($B56=\"\",\"\",$B56&\".\" &COUNTIFS($B$20:$B56,$B56))","v":""},{"$f":"IF(AND($A$10=\"YES\", COUNTIFS($B$19:$B55,Table!$B$7)<Table!$B$5),Table!$B$7,IF(AND($C$10=\"YES\", COUNTIFS($B$19:$B55,Table!$C$7)<Table!$C$5),Table!$C$7, IF(AND($D$10=\"YES\", COUNTIFS($B$19:$B55,Table!$D$7)<Table!$D$5),Table!$D$7, IF(AND($E$10=\"YES\", COUNTIFS($B$19:$B55,Table!$E$7)<Table!$E$5),Table!$E$7, IF(AND($F$10=\"YES\", COUNTIFS($B$19:$B55,Table!$F$7)<Table!$F$5),Table!$F$7,\"\")))))","v":""},{"$f":"+IF($A56=\"\",\"\",VLOOKUP($A56,Table!$A$20:$L$185,C$2,0))","v":""},{"$f":"+IF($A56=\"\",\"\",VLOOKUP($A56,Table!$A$20:$L$185,D$2,0)&\"\")","v":""},{"$f":"+IF($A56=\"\",\"\",VLOOKUP($A56,Table!$A$20:$L$185,E$2,0))","v":""},{"$f":"+IF($A56=\"\",\"\",VLOOKUP($A56,Table!$A$20:$L$185,F$2,0)&\"\")","v":""},{"$f":"+IF($A56=\"\",\"\",VLOOKUP($A56,Table!$A$20:$L$185,G$2,0))","v":""},{"$f":"+IF($A56=\"\",\"\",VLOOKUP($A56,Table!$A$20:$L$185,H$2,0)&\"\")","v":""},null,{"$f":"+IF($A56=\"\",\"\",VLOOKUP($A56,Table!$A$20:$L$185,J$2,0))","v":""},{"$f":"+IF($A56=\"\",\"\",VLOOKUP($A56,Table!$A$20:$L$185,K$2,0))","v":""},{"$f":"+IF($A56=\"\",\"\",VLOOKUP($A56,Table!$A$20:$L$185,L$2,0))","v":""},null,{"$f":"+IF($A56=\"\",\"\",VLOOKUP($A56,Table!$A$20:$L$185,N$2,0))","v":""},null,{"$f":"+IF(AND($A56<>\"\",$O56=\"YES\"),COUNTIF($O$19:$O56,\"YES\")&\".YC\",\"\")","v":""},""]
[{"$f":"IF($B57=\"\",\"\",$B57&\".\" &COUNTIFS($B$20:$B57,$B57))","v":""},{"$f":"IF(AND($A$10=\"YES\", COUNTIFS($B$19:$B56,Table!$B$7)<Table!$B$5),Table!$B$7,IF(AND($C$10=\"YES\", COUNTIFS($B$19:$B56,Table!$C$7)<Table!$C$5),Table!$C$7, IF(AND($D$10=\"YES\", COUNTIFS($B$19:$B56,Table!$D$7)<Table!$D$5),Table!$D$7, IF(AND($E$10=\"YES\", COUNTIFS($B$19:$B56,Table!$E$7)<Table!$E$5),Table!$E$7, IF(AND($F$10=\"YES\", COUNTIFS($B$19:$B56,Table!$F$7)<Table!$F$5),Table!$F$7,\"\")))))","v":""},{"$f":"+IF($A57=\"\",\"\",VLOOKUP($A57,Table!$A$20:$L$185,C$2,0))","v":""},{"$f":"+IF($A57=\"\",\"\",VLOOKUP($A57,Table!$A$20:$L$185,D$2,0)&\"\")","v":""},{"$f":"+IF($A57=\"\",\"\",VLOOKUP($A57,Table!$A$20:$L$185,E$2,0))","v":""},{"$f":"+IF($A57=\"\",\"\",VLOOKUP($A57,Table!$A$20:$L$185,F$2,0)&\"\")","v":""},{"$f":"+IF($A57=\"\",\"\",VLOOKUP($A57,Table!$A$20:$L$185,G$2,0))","v":""},{"$f":"+IF($A57=\"\",\"\",VLOOKUP($A57,Table!$A$20:$L$185,H$2,0)&\"\")","v":""},null,{"$f":"+IF($A57=\"\",\"\",VLOOKUP($A57,Table!$A$20:$L$185,J$2,0))","v":""},{"$f":"+IF($A57=\"\",\"\",VLOOKUP($A57,Table!$A$20:$L$185,K$2,0))","v":""},{"$f":"+IF($A57=\"\",\"\",VLOOKUP($A57,Table!$A$20:$L$185,L$2,0))","v":""},null,{"$f":"+IF($A57=\"\",\"\",VLOOKUP($A57,Table!$A$20:$L$185,N$2,0))","v":""},null,{"$f":"+IF(AND($A57<>\"\",$O57=\"YES\"),COUNTIF($O$19:$O57,\"YES\")&\".YC\",\"\")","v":""},""]
[{"$f":"IF($B58=\"\",\"\",$B58&\".\" &COUNTIFS($B$20:$B58,$B58))","v":""},{"$f":"IF(AND($A$10=\"YES\", COUNTIFS($B$19:$B57,Table!$B$7)<Table!$B$5),Table!$B$7,IF(AND($C$10=\"YES\", COUNTIFS($B$19:$B57,Table!$C$7)<Table!$C$5),Table!$C$7, IF(AND($D$10=\"YES\", COUNTIFS($B$19:$B57,Table!$D$7)<Table!$D$5),Table!$D$7, IF(AND($E$10=\"YES\", COUNTIFS($B$19:$B57,Table!$E$7)<Table!$E$5),Table!$E$7, IF(AND($F$10=\"YES\", COUNTIFS($B$19:$B57,Table!$F$7)<Table!$F$5),Table!$F$7,\"\")))))","v":""},{"$f":"+IF($A58=\"\",\"\",VLOOKUP($A58,Table!$A$20:$L$185,C$2,0))","v":""},{"$f":"+IF($A58=\"\",\"\",VLOOKUP($A58,Table!$A$20:$L$185,D$2,0)&\"\")","v":""},{"$f":"+IF($A58=\"\",\"\",VLOOKUP($A58,Table!$A$20:$L$185,E$2,0))","v":""},{"$f":"+IF($A58=\"\",\"\",VLOOKUP($A58,Table!$A$20:$L$185,F$2,0)&\"\")","v":""},{"$f":"+IF($A58=\"\",\"\",VLOOKUP($A58,Table!$A$20:$L$185,G$2,0))","v":""},{"$f":"+IF($A58=\"\",\"\",VLOOKUP($A58,Table!$A$20:$L$185,H$2,0)&\"\")","v":""},null,{"$f":"+IF($A58=\"\",\"\",VLOOKUP($A58,Table!$A$20:$L$185,J$2,0))","v":""},{"$f":"+IF($A58=\"\",\"\",VLOOKUP($A58,Table!$A$20:$L$185,K$2,0))","v":""},{"$f":"+IF($A58=\"\",\"\",VLOOKUP($A58,Table!$A$20:$L$185,L$2,0))","v":""},null,{"$f":"+IF($A58=\"\",\"\",VLOOKUP($A58,Table!$A$20:$L$185,N$2,0))","v":""},null,{"$f":"+IF(AND($A58<>\"\",$O58=\"YES\"),COUNTIF($O$19:$O58,\"YES\")&\".YC\",\"\")","v":""},""]
[{"$f":"IF($B59=\"\",\"\",$B59&\".\" &COUNTIFS($B$20:$B59,$B59))","v":""},{"$f":"IF(AND($A$10=\"YES\", COUNTIFS($B$19:$B58,Table!$B$7)<Table!$B$5),Table!$B$7,IF(AND($C$10=\"YES\", COUNTIFS($B$19:$B58,Table!$C$7)<Table!$C$5),Table!$C$7, IF(AND($D$10=\"YES\", COUNTIFS($B$19:$B58,Table!$D$7)<Table!$D$5),Table!$D$7, IF(AND($E$10=\"YES\", COUNTIFS($B$19:$B58,Table!$E$7)<Table!$E$5),Table!$E$7, IF(AND($F$10=\"YES\", COUNTIFS($B$19:$B58,Table!$F$7)<Table!$F$5),Table!$F$7,\"\")))))","v":""},{"$f":"+IF($A59=\"\",\"\",VLOOKUP($A59,Table!$A$20:$L$185,C$2,0))","v":""},{"$f":"+IF($A59=\"\",\"\",VLOOKUP($A59,Table!$A$20:$L$185,D$2,0)&\"\")","v":""},{"$f":"+IF($A59=\"\",\"\",VLOOKUP($A59,Table!$A$20:$L$185,E$2,0))","v":""},{"$f":"+IF($A59=\"\",\"\",VLOOKUP($A59,Table!$A$20:$L$185,F$2,0)&\"\")","v":""},{"$f":"+IF($A59=\"\",\"\",VLOOKUP($A59,Table!$A$20:$L$185,G$2,0))","v":""},{"$f":"+IF($A59=\"\",\"\",VLOOKUP($A59,Table!$A$20:$L$185,H$2,0)&\"\")","v":""},null,{"$f":"+IF($A59=\"\",\"\",VLOOKUP($A59,Table!$A$20:$L$185,J$2,0))","v":""},{"$f":"+IF($A59=\"\",\"\",VLOOKUP($A59,Table!$A$20:$L$185,K$2,0))","v":""},{"$f":"+IF($A59=\"\",\"\",VLOOKUP($A59,Table!$A$20:$L$185,L$2,0))","v":""},null,{"$f":"+IF($A59=\"\",\"\",VLOOKUP($A59,Table!$A$20:$L$185,N$2,0))","v":""},null,{"$f":"+IF(AND($A59<>\"\",$O59=\"YES\"),COUNTIF($O$19:$O59,\"YES\")&\".YC\",\"\")","v":""},""]
[{"$f":"IF($B60=\"\",\"\",$B60&\".\" &COUNTIFS($B$20:$B60,$B60))","v":""},{"$f":"IF(AND($A$10=\"YES\", COUNTIFS($B$19:$B59,Table!$B$7)<Table!$B$5),Table!$B$7,IF(AND($C$10=\"YES\", COUNTIFS($B$19:$B59,Table!$C$7)<Table!$C$5),Table!$C$7, IF(AND($D$10=\"YES\", COUNTIFS($B$19:$B59,Table!$D$7)<Table!$D$5),Table!$D$7, IF(AND($E$10=\"YES\", COUNTIFS($B$19:$B59,Table!$E$7)<Table!$E$5),Table!$E$7, IF(AND($F$10=\"YES\", COUNTIFS($B$19:$B59,Table!$F$7)<Table!$F$5),Table!$F$7,\"\")))))","v":""},{"$f":"+IF($A60=\"\",\"\",VLOOKUP($A60,Table!$A$20:$L$185,C$2,0))","v":""},{"$f":"+IF($A60=\"\",\"\",VLOOKUP($A60,Table!$A$20:$L$185,D$2,0)&\"\")","v":""},{"$f":"+IF($A60=\"\",\"\",VLOOKUP($A60,Table!$A$20:$L$185,E$2,0))","v":""},{"$f":"+IF($A60=\"\",\"\",VLOOKUP($A60,Table!$A$20:$L$185,F$2,0)&\"\")","v":""},{"$f":"+IF($A60=\"\",\"\",VLOOKUP($A60,Table!$A$20:$L$185,G$2,0))","v":""},{"$f":"+IF($A60=\"\",\"\",VLOOKUP($A60,Table!$A$20:$L$185,H$2,0)&\"\")","v":""},null,{"$f":"+IF($A60=\"\",\"\",VLOOKUP($A60,Table!$A$20:$L$185,J$2,0))","v":""},{"$f":"+IF($A60=\"\",\"\",VLOOKUP($A60,Table!$A$20:$L$185,K$2,0))","v":""},{"$f":"+IF($A60=\"\",\"\",VLOOKUP($A60,Table!$A$20:$L$185,L$2,0))","v":""},null,{"$f":"+IF($A60=\"\",\"\",VLOOKUP($A60,Table!$A$20:$L$185,N$2,0))","v":""},null,{"$f":"+IF(AND($A60<>\"\",$O60=\"YES\"),COUNTIF($O$19:$O60,\"YES\")&\".YC\",\"\")","v":""},""]
[{"$f":"IF($B61=\"\",\"\",$B61&\".\" &COUNTIFS($B$20:$B61,$B61))","v":""},{"$f":"IF(AND($A$10=\"YES\", COUNTIFS($B$19:$B60,Table!$B$7)<Table!$B$5),Table!$B$7,IF(AND($C$10=\"YES\", COUNTIFS($B$19:$B60,Table!$C$7)<Table!$C$5),Table!$C$7, IF(AND($D$10=\"YES\", COUNTIFS($B$19:$B60,Table!$D$7)<Table!$D$5),Table!$D$7, IF(AND($E$10=\"YES\", COUNTIFS($B$19:$B60,Table!$E$7)<Table!$E$5),Table!$E$7, IF(AND($F$10=\"YES\", COUNTIFS($B$19:$B60,Table!$F$7)<Table!$F$5),Table!$F$7,\"\")))))","v":""},{"$f":"+IF($A61=\"\",\"\",VLOOKUP($A61,Table!$A$20:$L$185,C$2,0))","v":""},{"$f":"+IF($A61=\"\",\"\",VLOOKUP($A61,Table!$A$20:$L$185,D$2,0)&\"\")","v":""},{"$f":"+IF($A61=\"\",\"\",VLOOKUP($A61,Table!$A$20:$L$185,E$2,0))","v":""},{"$f":"+IF($A61=\"\",\"\",VLOOKUP($A61,Table!$A$20:$L$185,F$2,0)&\"\")","v":""},{"$f":"+IF($A61=\"\",\"\",VLOOKUP($A61,Table!$A$20:$L$185,G$2,0))","v":""},{"$f":"+IF($A61=\"\",\"\",VLOOKUP($A61,Table!$A$20:$L$185,H$2,0)&\"\")","v":""},null,{"$f":"+IF($A61=\"\",\"\",VLOOKUP($A61,Table!$A$20:$L$185,J$2,0))","v":""},{"$f":"+IF($A61=\"\",\"\",VLOOKUP($A61,Table!$A$20:$L$185,K$2,0))","v":""},{"$f":"+IF($A61=\"\",\"\",VLOOKUP($A61,Table!$A$20:$L$185,L$2,0))","v":""},null,{"$f":"+IF($A61=\"\",\"\",VLOOKUP($A61,Table!$A$20:$L$185,N$2,0))","v":""},null,{"$f":"+IF(AND($A61<>\"\",$O61=\"YES\"),COUNTIF($O$19:$O61,\"YES\")&\".YC\",\"\")","v":""},""]
[{"$f":"IF($B62=\"\",\"\",$B62&\".\" &COUNTIFS($B$20:$B62,$B62))","v":""},{"$f":"IF(AND($A$10=\"YES\", COUNTIFS($B$19:$B61,Table!$B$7)<Table!$B$5),Table!$B$7,IF(AND($C$10=\"YES\", COUNTIFS($B$19:$B61,Table!$C$7)<Table!$C$5),Table!$C$7, IF(AND($D$10=\"YES\", COUNTIFS($B$19:$B61,Table!$D$7)<Table!$D$5),Table!$D$7, IF(AND($E$10=\"YES\", COUNTIFS($B$19:$B61,Table!$E$7)<Table!$E$5),Table!$E$7, IF(AND($F$10=\"YES\", COUNTIFS($B$19:$B61,Table!$F$7)<Table!$F$5),Table!$F$7,\"\")))))","v":""},{"$f":"+IF($A62=\"\",\"\",VLOOKUP($A62,Table!$A$20:$L$185,C$2,0))","v":""},{"$f":"+IF($A62=\"\",\"\",VLOOKUP($A62,Table!$A$20:$L$185,D$2,0)&\"\")","v":""},{"$f":"+IF($A62=\"\",\"\",VLOOKUP($A62,Table!$A$20:$L$185,E$2,0))","v":""},{"$f":"+IF($A62=\"\",\"\",VLOOKUP($A62,Table!$A$20:$L$185,F$2,0)&\"\")","v":""},{"$f":"+IF($A62=\"\",\"\",VLOOKUP($A62,Table!$A$20:$L$185,G$2,0))","v":""},{"$f":"+IF($A62=\"\",\"\",VLOOKUP($A62,Table!$A$20:$L$185,H$2,0)&\"\")","v":""},null,{"$f":"+IF($A62=\"\",\"\",VLOOKUP($A62,Table!$A$20:$L$185,J$2,0))","v":""},{"$f":"+IF($A62=\"\",\"\",VLOOKUP($A62,Table!$A$20:$L$185,K$2,0))","v":""},{"$f":"+IF($A62=\"\",\"\",VLOOKUP($A62,Table!$A$20:$L$185,L$2,0))","v":""},null,{"$f":"+IF($A62=\"\",\"\",VLOOKUP($A62,Table!$A$20:$L$185,N$2,0))","v":""},null,{"$f":"+IF(AND($A62<>\"\",$O62=\"YES\"),COUNTIF($O$19:$O62,\"YES\")&\".YC\",\"\")","v":""},""]
[{"$f":"IF($B63=\"\",\"\",$B63&\".\" &COUNTIFS($B$20:$B63,$B63))","v":""},{"$f":"IF(AND($A$10=\"YES\", COUNTIFS($B$19:$B62,Table!$B$7)<Table!$B$5),Table!$B$7,IF(AND($C$10=\"YES\", COUNTIFS($B$19:$B62,Table!$C$7)<Table!$C$5),Table!$C$7, IF(AND($D$10=\"YES\", COUNTIFS($B$19:$B62,Table!$D$7)<Table!$D$5),Table!$D$7, IF(AND($E$10=\"YES\", COUNTIFS($B$19:$B62,Table!$E$7)<Table!$E$5),Table!$E$7, IF(AND($F$10=\"YES\", COUNTIFS($B$19:$B62,Table!$F$7)<Table!$F$5),Table!$F$7,\"\")))))","v":""},{"$f":"+IF($A63=\"\",\"\",VLOOKUP($A63,Table!$A$20:$L$185,C$2,0))","v":""},{"$f":"+IF($A63=\"\",\"\",VLOOKUP($A63,Table!$A$20:$L$185,D$2,0)&\"\")","v":""},{"$f":"+IF($A63=\"\",\"\",VLOOKUP($A63,Table!$A$20:$L$185,E$2,0))","v":""},{"$f":"+IF($A63=\"\",\"\",VLOOKUP($A63,Table!$A$20:$L$185,F$2,0)&\"\")","v":""},{"$f":"+IF($A63=\"\",\"\",VLOOKUP($A63,Table!$A$20:$L$185,G$2,0))","v":""},{"$f":"+IF($A63=\"\",\"\",VLOOKUP($A63,Table!$A$20:$L$185,H$2,0)&\"\")","v":""},null,{"$f":"+IF($A63=\"\",\"\",VLOOKUP($A63,Table!$A$20:$L$185,J$2,0))","v":""},{"$f":"+IF($A63=\"\",\"\",VLOOKUP($A63,Table!$A$20:$L$185,K$2,0))","v":""},{"$f":"+IF($A63=\"\",\"\",VLOOKUP($A63,Table!$A$20:$L$185,L$2,0))","v":""},null,{"$f":"+IF($A63=\"\",\"\",VLOOKUP($A63,Table!$A$20:$L$185,N$2,0))","v":""},null,{"$f":"+IF(AND($A63<>\"\",$O63=\"YES\"),COUNTIF($O$19:$O63,\"YES\")&\".YC\",\"\")","v":""},""]
[{"$f":"IF($B64=\"\",\"\",$B64&\".\" &COUNTIFS($B$20:$B64,$B64))","v":""},{"$f":"IF(AND($A$10=\"YES\", COUNTIFS($B$19:$B63,Table!$B$7)<Table!$B$5),Table!$B$7,IF(AND($C$10=\"YES\", COUNTIFS($B$19:$B63,Table!$C$7)<Table!$C$5),Table!$C$7, IF(AND($D$10=\"YES\", COUNTIFS($B$19:$B63,Table!$D$7)<Table!$D$5),Table!$D$7, IF(AND($E$10=\"YES\", COUNTIFS($B$19:$B63,Table!$E$7)<Table!$E$5),Table!$E$7, IF(AND($F$10=\"YES\", COUNTIFS($B$19:$B63,Table!$F$7)<Table!$F$5),Table!$F$7,\"\")))))","v":""},{"$f":"+IF($A64=\"\",\"\",VLOOKUP($A64,Table!$A$20:$L$185,C$2,0))","v":""},{"$f":"+IF($A64=\"\",\"\",VLOOKUP($A64,Table!$A$20:$L$185,D$2,0)&\"\")","v":""},{"$f":"+IF($A64=\"\",\"\",VLOOKUP($A64,Table!$A$20:$L$185,E$2,0))","v":""},{"$f":"+IF($A64=\"\",\"\",VLOOKUP($A64,Table!$A$20:$L$185,F$2,0)&\"\")","v":""},{"$f":"+IF($A64=\"\",\"\",VLOOKUP($A64,Table!$A$20:$L$185,G$2,0))","v":""},{"$f":"+IF($A64=\"\",\"\",VLOOKUP($A64,Table!$A$20:$L$185,H$2,0)&\"\")","v":""},null,{"$f":"+IF($A64=\"\",\"\",VLOOKUP($A64,Table!$A$20:$L$185,J$2,0))","v":""},{"$f":"+IF($A64=\"\",\"\",VLOOKUP($A64,Table!$A$20:$L$185,K$2,0))","v":""},{"$f":"+IF($A64=\"\",\"\",VLOOKUP($A64,Table!$A$20:$L$185,L$2,0))","v":""},null,{"$f":"+IF($A64=\"\",\"\",VLOOKUP($A64,Table!$A$20:$L$185,N$2,0))","v":""},null,{"$f":"+IF(AND($A64<>\"\",$O64=\"YES\"),COUNTIF($O$19:$O64,\"YES\")&\".YC\",\"\")","v":""},""]
[{"$f":"IF($B65=\"\",\"\",$B65&\".\" &COUNTIFS($B$20:$B65,$B65))","v":""},{"$f":"IF(AND($A$10=\"YES\", COUNTIFS($B$19:$B64,Table!$B$7)<Table!$B$5),Table!$B$7,IF(AND($C$10=\"YES\", COUNTIFS($B$19:$B64,Table!$C$7)<Table!$C$5),Table!$C$7, IF(AND($D$10=\"YES\", COUNTIFS($B$19:$B64,Table!$D$7)<Table!$D$5),Table!$D$7, IF(AND($E$10=\"YES\", COUNTIFS($B$19:$B64,Table!$E$7)<Table!$E$5),Table!$E$7, IF(AND($F$10=\"YES\", COUNTIFS($B$19:$B64,Table!$F$7)<Table!$F$5),Table!$F$7,\"\")))))","v":""},{"$f":"+IF($A65=\"\",\"\",VLOOKUP($A65,Table!$A$20:$L$185,C$2,0))","v":""},{"$f":"+IF($A65=\"\",\"\",VLOOKUP($A65,Table!$A$20:$L$185,D$2,0)&\"\")","v":""},{"$f":"+IF($A65=\"\",\"\",VLOOKUP($A65,Table!$A$20:$L$185,E$2,0))","v":""},{"$f":"+IF($A65=\"\",\"\",VLOOKUP($A65,Table!$A$20:$L$185,F$2,0)&\"\")","v":""},{"$f":"+IF($A65=\"\",\"\",VLOOKUP($A65,Table!$A$20:$L$185,G$2,0))","v":""},{"$f":"+IF($A65=\"\",\"\",VLOOKUP($A65,Table!$A$20:$L$185,H$2,0)&\"\")","v":""},null,{"$f":"+IF($A65=\"\",\"\",VLOOKUP($A65,Table!$A$20:$L$185,J$2,0))","v":""},{"$f":"+IF($A65=\"\",\"\",VLOOKUP($A65,Table!$A$20:$L$185,K$2,0))","v":""},{"$f":"+IF($A65=\"\",\"\",VLOOKUP($A65,Table!$A$20:$L$185,L$2,0))","v":""},null,{"$f":"+IF($A65=\"\",\"\",VLOOKUP($A65,Table!$A$20:$L$185,N$2,0))","v":""},null,{"$f":"+IF(AND($A65<>\"\",$O65=\"YES\"),COUNTIF($O$19:$O65,\"YES\")&\".YC\",\"\")","v":""},""]
[{"$f":"IF($B66=\"\",\"\",$B66&\".\" &COUNTIFS($B$20:$B66,$B66))","v":""},{"$f":"IF(AND($A$10=\"YES\", COUNTIFS($B$19:$B65,Table!$B$7)<Table!$B$5),Table!$B$7,IF(AND($C$10=\"YES\", COUNTIFS($B$19:$B65,Table!$C$7)<Table!$C$5),Table!$C$7, IF(AND($D$10=\"YES\", COUNTIFS($B$19:$B65,Table!$D$7)<Table!$D$5),Table!$D$7, IF(AND($E$10=\"YES\", COUNTIFS($B$19:$B65,Table!$E$7)<Table!$E$5),Table!$E$7, IF(AND($F$10=\"YES\", COUNTIFS($B$19:$B65,Table!$F$7)<Table!$F$5),Table!$F$7,\"\")))))","v":""},{"$f":"+IF($A66=\"\",\"\",VLOOKUP($A66,Table!$A$20:$L$185,C$2,0))","v":""},{"$f":"+IF($A66=\"\",\"\",VLOOKUP($A66,Table!$A$20:$L$185,D$2,0)&\"\")","v":""},{"$f":"+IF($A66=\"\",\"\",VLOOKUP($A66,Table!$A$20:$L$185,E$2,0))","v":""},{"$f":"+IF($A66=\"\",\"\",VLOOKUP($A66,Table!$A$20:$L$185,F$2,0)&\"\")","v":""},{"$f":"+IF($A66=\"\",\"\",VLOOKUP($A66,Table!$A$20:$L$185,G$2,0))","v":""},{"$f":"+IF($A66=\"\",\"\",VLOOKUP($A66,Table!$A$20:$L$185,H$2,0)&\"\")","v":""},null,{"$f":"+IF($A66=\"\",\"\",VLOOKUP($A66,Table!$A$20:$L$185,J$2,0))","v":""},{"$f":"+IF($A66=\"\",\"\",VLOOKUP($A66,Table!$A$20:$L$185,K$2,0))","v":""},{"$f":"+IF($A66=\"\",\"\",VLOOKUP($A66,Table!$A$20:$L$185,L$2,0))","v":""},null,{"$f":"+IF($A66=\"\",\"\",VLOOKUP($A66,Table!$A$20:$L$185,N$2,0))","v":""},null,{"$f":"+IF(AND($A66<>\"\",$O66=\"YES\"),COUNTIF($O$19:$O66,\"YES\")&\".YC\",\"\")","v":""},""]
[{"$f":"IF($B67=\"\",\"\",$B67&\".\" &COUNTIFS($B$20:$B67,$B67))","v":""},{"$f":"IF(AND($A$10=\"YES\", COUNTIFS($B$19:$B66,Table!$B$7)<Table!$B$5),Table!$B$7,IF(AND($C$10=\"YES\", COUNTIFS($B$19:$B66,Table!$C$7)<Table!$C$5),Table!$C$7, IF(AND($D$10=\"YES\", COUNTIFS($B$19:$B66,Table!$D$7)<Table!$D$5),Table!$D$7, IF(AND($E$10=\"YES\", COUNTIFS($B$19:$B66,Table!$E$7)<Table!$E$5),Table!$E$7, IF(AND($F$10=\"YES\", COUNTIFS($B$19:$B66,Table!$F$7)<Table!$F$5),Table!$F$7,\"\")))))","v":""},{"$f":"+IF($A67=\"\",\"\",VLOOKUP($A67,Table!$A$20:$L$185,C$2,0))","v":""},{"$f":"+IF($A67=\"\",\"\",VLOOKUP($A67,Table!$A$20:$L$185,D$2,0)&\"\")","v":""},{"$f":"+IF($A67=\"\",\"\",VLOOKUP($A67,Table!$A$20:$L$185,E$2,0))","v":""},{"$f":"+IF($A67=\"\",\"\",VLOOKUP($A67,Table!$A$20:$L$185,F$2,0)&\"\")","v":""},{"$f":"+IF($A67=\"\",\"\",VLOOKUP($A67,Table!$A$20:$L$185,G$2,0))","v":""},{"$f":"+IF($A67=\"\",\"\",VLOOKUP($A67,Table!$A$20:$L$185,H$2,0)&\"\")","v":""},null,{"$f":"+IF($A67=\"\",\"\",VLOOKUP($A67,Table!$A$20:$L$185,J$2,0))","v":""},{"$f":"+IF($A67=\"\",\"\",VLOOKUP($A67,Table!$A$20:$L$185,K$2,0))","v":""},{"$f":"+IF($A67=\"\",\"\",VLOOKUP($A67,Table!$A$20:$L$185,L$2,0))","v":""},null,{"$f":"+IF($A67=\"\",\"\",VLOOKUP($A67,Table!$A$20:$L$185,N$2,0))","v":""},null,{"$f":"+IF(AND($A67<>\"\",$O67=\"YES\"),COUNTIF($O$19:$O67,\"YES\")&\".YC\",\"\")","v":""},""]
[{"$f":"IF($B68=\"\",\"\",$B68&\".\" &COUNTIFS($B$20:$B68,$B68))","v":""},{"$f":"IF(AND($A$10=\"YES\", COUNTIFS($B$19:$B67,Table!$B$7)<Table!$B$5),Table!$B$7,IF(AND($C$10=\"YES\", COUNTIFS($B$19:$B67,Table!$C$7)<Table!$C$5),Table!$C$7, IF(AND($D$10=\"YES\", COUNTIFS($B$19:$B67,Table!$D$7)<Table!$D$5),Table!$D$7, IF(AND($E$10=\"YES\", COUNTIFS($B$19:$B67,Table!$E$7)<Table!$E$5),Table!$E$7, IF(AND($F$10=\"YES\", COUNTIFS($B$19:$B67,Table!$F$7)<Table!$F$5),Table!$F$7,\"\")))))","v":""},{"$f":"+IF($A68=\"\",\"\",VLOOKUP($A68,Table!$A$20:$L$185,C$2,0))","v":""},{"$f":"+IF($A68=\"\",\"\",VLOOKUP($A68,Table!$A$20:$L$185,D$2,0)&\"\")","v":""},{"$f":"+IF($A68=\"\",\"\",VLOOKUP($A68,Table!$A$20:$L$185,E$2,0))","v":""},{"$f":"+IF($A68=\"\",\"\",VLOOKUP($A68,Table!$A$20:$L$185,F$2,0)&\"\")","v":""},{"$f":"+IF($A68=\"\",\"\",VLOOKUP($A68,Table!$A$20:$L$185,G$2,0))","v":""},{"$f":"+IF($A68=\"\",\"\",VLOOKUP($A68,Table!$A$20:$L$185,H$2,0)&\"\")","v":""},null,{"$f":"+IF($A68=\"\",\"\",VLOOKUP($A68,Table!$A$20:$L$185,J$2,0))","v":""},{"$f":"+IF($A68=\"\",\"\",VLOOKUP($A68,Table!$A$20:$L$185,K$2,0))","v":""},{"$f":"+IF($A68=\"\",\"\",VLOOKUP($A68,Table!$A$20:$L$185,L$2,0))","v":""},null,{"$f":"+IF($A68=\"\",\"\",VLOOKUP($A68,Table!$A$20:$L$185,N$2,0))","v":""},null,{"$f":"+IF(AND($A68<>\"\",$O68=\"YES\"),COUNTIF($O$19:$O68,\"YES\")&\".YC\",\"\")","v":""},""]
[{"$f":"IF($B69=\"\",\"\",$B69&\".\" &COUNTIFS($B$20:$B69,$B69))","v":""},{"$f":"IF(AND($A$10=\"YES\", COUNTIFS($B$19:$B68,Table!$B$7)<Table!$B$5),Table!$B$7,IF(AND($C$10=\"YES\", COUNTIFS($B$19:$B68,Table!$C$7)<Table!$C$5),Table!$C$7, IF(AND($D$10=\"YES\", COUNTIFS($B$19:$B68,Table!$D$7)<Table!$D$5),Table!$D$7, IF(AND($E$10=\"YES\", COUNTIFS($B$19:$B68,Table!$E$7)<Table!$E$5),Table!$E$7, IF(AND($F$10=\"YES\", COUNTIFS($B$19:$B68,Table!$F$7)<Table!$F$5),Table!$F$7,\"\")))))","v":""},{"$f":"+IF($A69=\"\",\"\",VLOOKUP($A69,Table!$A$20:$L$185,C$2,0))","v":""},{"$f":"+IF($A69=\"\",\"\",VLOOKUP($A69,Table!$A$20:$L$185,D$2,0)&\"\")","v":""},{"$f":"+IF($A69=\"\",\"\",VLOOKUP($A69,Table!$A$20:$L$185,E$2,0))","v":""},{"$f":"+IF($A69=\"\",\"\",VLOOKUP($A69,Table!$A$20:$L$185,F$2,0)&\"\")","v":""},{"$f":"+IF($A69=\"\",\"\",VLOOKUP($A69,Table!$A$20:$L$185,G$2,0))","v":""},{"$f":"+IF($A69=\"\",\"\",VLOOKUP($A69,Table!$A$20:$L$185,H$2,0)&\"\")","v":""},null,{"$f":"+IF($A69=\"\",\"\",VLOOKUP($A69,Table!$A$20:$L$185,J$2,0))","v":""},{"$f":"+IF($A69=\"\",\"\",VLOOKUP($A69,Table!$A$20:$L$185,K$2,0))","v":""},{"$f":"+IF($A69=\"\",\"\",VLOOKUP($A69,Table!$A$20:$L$185,L$2,0))","v":""},null,{"$f":"+IF($A69=\"\",\"\",VLOOKUP($A69,Table!$A$20:$L$185,N$2,0))","v":""},null,{"$f":"+IF(AND($A69<>\"\",$O69=\"YES\"),COUNTIF($O$19:$O69,\"YES\")&\".YC\",\"\")","v":""},""]
[{"$f":"IF($B70=\"\",\"\",$B70&\".\" &COUNTIFS($B$20:$B70,$B70))","v":""},{"$f":"IF(AND($A$10=\"YES\", COUNTIFS($B$19:$B69,Table!$B$7)<Table!$B$5),Table!$B$7,IF(AND($C$10=\"YES\", COUNTIFS($B$19:$B69,Table!$C$7)<Table!$C$5),Table!$C$7, IF(AND($D$10=\"YES\", COUNTIFS($B$19:$B69,Table!$D$7)<Table!$D$5),Table!$D$7, IF(AND($E$10=\"YES\", COUNTIFS($B$19:$B69,Table!$E$7)<Table!$E$5),Table!$E$7, IF(AND($F$10=\"YES\", COUNTIFS($B$19:$B69,Table!$F$7)<Table!$F$5),Table!$F$7,\"\")))))","v":""},{"$f":"+IF($A70=\"\",\"\",VLOOKUP($A70,Table!$A$20:$L$185,C$2,0))","v":""},{"$f":"+IF($A70=\"\",\"\",VLOOKUP($A70,Table!$A$20:$L$185,D$2,0)&\"\")","v":""},{"$f":"+IF($A70=\"\",\"\",VLOOKUP($A70,Table!$A$20:$L$185,E$2,0))","v":""},{"$f":"+IF($A70=\"\",\"\",VLOOKUP($A70,Table!$A$20:$L$185,F$2,0)&\"\")","v":""},{"$f":"+IF($A70=\"\",\"\",VLOOKUP($A70,Table!$A$20:$L$185,G$2,0))","v":""},{"$f":"+IF($A70=\"\",\"\",VLOOKUP($A70,Table!$A$20:$L$185,H$2,0)&\"\")","v":""},null,{"$f":"+IF($A70=\"\",\"\",VLOOKUP($A70,Table!$A$20:$L$185,J$2,0))","v":""},{"$f":"+IF($A70=\"\",\"\",VLOOKUP($A70,Table!$A$20:$L$185,K$2,0))","v":""},{"$f":"+IF($A70=\"\",\"\",VLOOKUP($A70,Table!$A$20:$L$185,L$2,0))","v":""},null,{"$f":"+IF($A70=\"\",\"\",VLOOKUP($A70,Table!$A$20:$L$185,N$2,0))","v":""},null,{"$f":"+IF(AND($A70<>\"\",$O70=\"YES\"),COUNTIF($O$19:$O70,\"YES\")&\".YC\",\"\")","v":""},""]
[{"$f":"IF($B71=\"\",\"\",$B71&\".\" &COUNTIFS($B$20:$B71,$B71))","v":""},{"$f":"IF(AND($A$10=\"YES\", COUNTIFS($B$19:$B70,Table!$B$7)<Table!$B$5),Table!$B$7,IF(AND($C$10=\"YES\", COUNTIFS($B$19:$B70,Table!$C$7)<Table!$C$5),Table!$C$7, IF(AND($D$10=\"YES\", COUNTIFS($B$19:$B70,Table!$D$7)<Table!$D$5),Table!$D$7, IF(AND($E$10=\"YES\", COUNTIFS($B$19:$B70,Table!$E$7)<Table!$E$5),Table!$E$7, IF(AND($F$10=\"YES\", COUNTIFS($B$19:$B70,Table!$F$7)<Table!$F$5),Table!$F$7,\"\")))))","v":""},{"$f":"+IF($A71=\"\",\"\",VLOOKUP($A71,Table!$A$20:$L$185,C$2,0))","v":""},{"$f":"+IF($A71=\"\",\"\",VLOOKUP($A71,Table!$A$20:$L$185,D$2,0)&\"\")","v":""},{"$f":"+IF($A71=\"\",\"\",VLOOKUP($A71,Table!$A$20:$L$185,E$2,0))","v":""},{"$f":"+IF($A71=\"\",\"\",VLOOKUP($A71,Table!$A$20:$L$185,F$2,0)&\"\")","v":""},{"$f":"+IF($A71=\"\",\"\",VLOOKUP($A71,Table!$A$20:$L$185,G$2,0))","v":""},{"$f":"+IF($A71=\"\",\"\",VLOOKUP($A71,Table!$A$20:$L$185,H$2,0)&\"\")","v":""},null,{"$f":"+IF($A71=\"\",\"\",VLOOKUP($A71,Table!$A$20:$L$185,J$2,0))","v":""},{"$f":"+IF($A71=\"\",\"\",VLOOKUP($A71,Table!$A$20:$L$185,K$2,0))","v":""},{"$f":"+IF($A71=\"\",\"\",VLOOKUP($A71,Table!$A$20:$L$185,L$2,0))","v":""},null,{"$f":"+IF($A71=\"\",\"\",VLOOKUP($A71,Table!$A$20:$L$185,N$2,0))","v":""},null,{"$f":"+IF(AND($A71<>\"\",$O71=\"YES\"),COUNTIF($O$19:$O71,\"YES\")&\".YC\",\"\")","v":""},""]
[{"$f":"IF($B72=\"\",\"\",$B72&\".\" &COUNTIFS($B$20:$B72,$B72))","v":""},{"$f":"IF(AND($A$10=\"YES\", COUNTIFS($B$19:$B71,Table!$B$7)<Table!$B$5),Table!$B$7,IF(AND($C$10=\"YES\", COUNTIFS($B$19:$B71,Table!$C$7)<Table!$C$5),Table!$C$7, IF(AND($D$10=\"YES\", COUNTIFS($B$19:$B71,Table!$D$7)<Table!$D$5),Table!$D$7, IF(AND($E$10=\"YES\", COUNTIFS($B$19:$B71,Table!$E$7)<Table!$E$5),Table!$E$7, IF(AND($F$10=\"YES\", COUNTIFS($B$19:$B71,Table!$F$7)<Table!$F$5),Table!$F$7,\"\")))))","v":""},{"$f":"+IF($A72=\"\",\"\",VLOOKUP($A72,Table!$A$20:$L$185,C$2,0))","v":""},{"$f":"+IF($A72=\"\",\"\",VLOOKUP($A72,Table!$A$20:$L$185,D$2,0)&\"\")","v":""},{"$f":"+IF($A72=\"\",\"\",VLOOKUP($A72,Table!$A$20:$L$185,E$2,0))","v":""},{"$f":"+IF($A72=\"\",\"\",VLOOKUP($A72,Table!$A$20:$L$185,F$2,0)&\"\")","v":""},{"$f":"+IF($A72=\"\",\"\",VLOOKUP($A72,Table!$A$20:$L$185,G$2,0))","v":""},{"$f":"+IF($A72=\"\",\"\",VLOOKUP($A72,Table!$A$20:$L$185,H$2,0)&\"\")","v":""},null,{"$f":"+IF($A72=\"\",\"\",VLOOKUP($A72,Table!$A$20:$L$185,J$2,0))","v":""},{"$f":"+IF($A72=\"\",\"\",VLOOKUP($A72,Table!$A$20:$L$185,K$2,0))","v":""},{"$f":"+IF($A72=\"\",\"\",VLOOKUP($A72,Table!$A$20:$L$185,L$2,0))","v":""},null,{"$f":"+IF($A72=\"\",\"\",VLOOKUP($A72,Table!$A$20:$L$185,N$2,0))","v":""},null,{"$f":"+IF(AND($A72<>\"\",$O72=\"YES\"),COUNTIF($O$19:$O72,\"YES\")&\".YC\",\"\")","v":""},""]
[{"$f":"IF($B73=\"\",\"\",$B73&\".\" &COUNTIFS($B$20:$B73,$B73))","v":""},{"$f":"IF(AND($A$10=\"YES\", COUNTIFS($B$19:$B72,Table!$B$7)<Table!$B$5),Table!$B$7,IF(AND($C$10=\"YES\", COUNTIFS($B$19:$B72,Table!$C$7)<Table!$C$5),Table!$C$7, IF(AND($D$10=\"YES\", COUNTIFS($B$19:$B72,Table!$D$7)<Table!$D$5),Table!$D$7, IF(AND($E$10=\"YES\", COUNTIFS($B$19:$B72,Table!$E$7)<Table!$E$5),Table!$E$7, IF(AND($F$10=\"YES\", COUNTIFS($B$19:$B72,Table!$F$7)<Table!$F$5),Table!$F$7,\"\")))))","v":""},{"$f":"+IF($A73=\"\",\"\",VLOOKUP($A73,Table!$A$20:$L$185,C$2,0))","v":""},{"$f":"+IF($A73=\"\",\"\",VLOOKUP($A73,Table!$A$20:$L$185,D$2,0)&\"\")","v":""},{"$f":"+IF($A73=\"\",\"\",VLOOKUP($A73,Table!$A$20:$L$185,E$2,0))","v":""},{"$f":"+IF($A73=\"\",\"\",VLOOKUP($A73,Table!$A$20:$L$185,F$2,0)&\"\")","v":""},{"$f":"+IF($A73=\"\",\"\",VLOOKUP($A73,Table!$A$20:$L$185,G$2,0))","v":""},{"$f":"+IF($A73=\"\",\"\",VLOOKUP($A73,Table!$A$20:$L$185,H$2,0)&\"\")","v":""},null,{"$f":"+IF($A73=\"\",\"\",VLOOKUP($A73,Table!$A$20:$L$185,J$2,0))","v":""},{"$f":"+IF($A73=\"\",\"\",VLOOKUP($A73,Table!$A$20:$L$185,K$2,0))","v":""},{"$f":"+IF($A73=\"\",\"\",VLOOKUP($A73,Table!$A$20:$L$185,L$2,0))","v":""},null,{"$f":"+IF($A73=\"\",\"\",VLOOKUP($A73,Table!$A$20:$L$185,N$2,0))","v":""},null,{"$f":"+IF(AND($A73<>\"\",$O73=\"YES\"),COUNTIF($O$19:$O73,\"YES\")&\".YC\",\"\")","v":""},""]
[{"$f":"IF($B74=\"\",\"\",$B74&\".\" &COUNTIFS($B$20:$B74,$B74))","v":""},{"$f":"IF(AND($A$10=\"YES\", COUNTIFS($B$19:$B73,Table!$B$7)<Table!$B$5),Table!$B$7,IF(AND($C$10=\"YES\", COUNTIFS($B$19:$B73,Table!$C$7)<Table!$C$5),Table!$C$7, IF(AND($D$10=\"YES\", COUNTIFS($B$19:$B73,Table!$D$7)<Table!$D$5),Table!$D$7, IF(AND($E$10=\"YES\", COUNTIFS($B$19:$B73,Table!$E$7)<Table!$E$5),Table!$E$7, IF(AND($F$10=\"YES\", COUNTIFS($B$19:$B73,Table!$F$7)<Table!$F$5),Table!$F$7,\"\")))))","v":""},{"$f":"+IF($A74=\"\",\"\",VLOOKUP($A74,Table!$A$20:$L$185,C$2,0))","v":""},{"$f":"+IF($A74=\"\",\"\",VLOOKUP($A74,Table!$A$20:$L$185,D$2,0)&\"\")","v":""},{"$f":"+IF($A74=\"\",\"\",VLOOKUP($A74,Table!$A$20:$L$185,E$2,0))","v":""},{"$f":"+IF($A74=\"\",\"\",VLOOKUP($A74,Table!$A$20:$L$185,F$2,0)&\"\")","v":""},{"$f":"+IF($A74=\"\",\"\",VLOOKUP($A74,Table!$A$20:$L$185,G$2,0))","v":""},{"$f":"+IF($A74=\"\",\"\",VLOOKUP($A74,Table!$A$20:$L$185,H$2,0)&\"\")","v":""},null,{"$f":"+IF($A74=\"\",\"\",VLOOKUP($A74,Table!$A$20:$L$185,J$2,0))","v":""},{"$f":"+IF($A74=\"\",\"\",VLOOKUP($A74,Table!$A$20:$L$185,K$2,0))","v":""},{"$f":"+IF($A74=\"\",\"\",VLOOKUP($A74,Table!$A$20:$L$185,L$2,0))","v":""},null,{"$f":"+IF($A74=\"\",\"\",VLOOKUP($A74,Table!$A$20:$L$185,N$2,0))","v":""},null,{"$f":"+IF(AND($A74<>\"\",$O74=\"YES\"),COUNTIF($O$19:$O74,\"YES\")&\".YC\",\"\")","v":""},""]
[{"$f":"IF($B75=\"\",\"\",$B75&\".\" &COUNTIFS($B$20:$B75,$B75))","v":""},{"$f":"IF(AND($A$10=\"YES\", COUNTIFS($B$19:$B74,Table!$B$7)<Table!$B$5),Table!$B$7,IF(AND($C$10=\"YES\", COUNTIFS($B$19:$B74,Table!$C$7)<Table!$C$5),Table!$C$7, IF(AND($D$10=\"YES\", COUNTIFS($B$19:$B74,Table!$D$7)<Table!$D$5),Table!$D$7, IF(AND($E$10=\"YES\", COUNTIFS($B$19:$B74,Table!$E$7)<Table!$E$5),Table!$E$7, IF(AND($F$10=\"YES\", COUNTIFS($B$19:$B74,Table!$F$7)<Table!$F$5),Table!$F$7,\"\")))))","v":""},{"$f":"+IF($A75=\"\",\"\",VLOOKUP($A75,Table!$A$20:$L$185,C$2,0))","v":""},{"$f":"+IF($A75=\"\",\"\",VLOOKUP($A75,Table!$A$20:$L$185,D$2,0)&\"\")","v":""},{"$f":"+IF($A75=\"\",\"\",VLOOKUP($A75,Table!$A$20:$L$185,E$2,0))","v":""},{"$f":"+IF($A75=\"\",\"\",VLOOKUP($A75,Table!$A$20:$L$185,F$2,0)&\"\")","v":""},{"$f":"+IF($A75=\"\",\"\",VLOOKUP($A75,Table!$A$20:$L$185,G$2,0))","v":""},{"$f":"+IF($A75=\"\",\"\",VLOOKUP($A75,Table!$A$20:$L$185,H$2,0)&\"\")","v":""},null,{"$f":"+IF($A75=\"\",\"\",VLOOKUP($A75,Table!$A$20:$L$185,J$2,0))","v":""},{"$f":"+IF($A75=\"\",\"\",VLOOKUP($A75,Table!$A$20:$L$185,K$2,0))","v":""},{"$f":"+IF($A75=\"\",\"\",VLOOKUP($A75,Table!$A$20:$L$185,L$2,0))","v":""},null,{"$f":"+IF($A75=\"\",\"\",VLOOKUP($A75,Table!$A$20:$L$185,N$2,0))","v":""},null,{"$f":"+IF(AND($A75<>\"\",$O75=\"YES\"),COUNTIF($O$19:$O75,\"YES\")&\".YC\",\"\")","v":""},""]
[{"$f":"IF($B76=\"\",\"\",$B76&\".\" &COUNTIFS($B$20:$B76,$B76))","v":""},{"$f":"IF(AND($A$10=\"YES\", COUNTIFS($B$19:$B75,Table!$B$7)<Table!$B$5),Table!$B$7,IF(AND($C$10=\"YES\", COUNTIFS($B$19:$B75,Table!$C$7)<Table!$C$5),Table!$C$7, IF(AND($D$10=\"YES\", COUNTIFS($B$19:$B75,Table!$D$7)<Table!$D$5),Table!$D$7, IF(AND($E$10=\"YES\", COUNTIFS($B$19:$B75,Table!$E$7)<Table!$E$5),Table!$E$7, IF(AND($F$10=\"YES\", COUNTIFS($B$19:$B75,Table!$F$7)<Table!$F$5),Table!$F$7,\"\")))))","v":""},{"$f":"+IF($A76=\"\",\"\",VLOOKUP($A76,Table!$A$20:$L$185,C$2,0))","v":""},{"$f":"+IF($A76=\"\",\"\",VLOOKUP($A76,Table!$A$20:$L$185,D$2,0)&\"\")","v":""},{"$f":"+IF($A76=\"\",\"\",VLOOKUP($A76,Table!$A$20:$L$185,E$2,0))","v":""},{"$f":"+IF($A76=\"\",\"\",VLOOKUP($A76,Table!$A$20:$L$185,F$2,0)&\"\")","v":""},{"$f":"+IF($A76=\"\",\"\",VLOOKUP($A76,Table!$A$20:$L$185,G$2,0))","v":""},{"$f":"+IF($A76=\"\",\"\",VLOOKUP($A76,Table!$A$20:$L$185,H$2,0)&\"\")","v":""},null,{"$f":"+IF($A76=\"\",\"\",VLOOKUP($A76,Table!$A$20:$L$185,J$2,0))","v":""},{"$f":"+IF($A76=\"\",\"\",VLOOKUP($A76,Table!$A$20:$L$185,K$2,0))","v":""},{"$f":"+IF($A76=\"\",\"\",VLOOKUP($A76,Table!$A$20:$L$185,L$2,0))","v":""},null,{"$f":"+IF($A76=\"\",\"\",VLOOKUP($A76,Table!$A$20:$L$185,N$2,0))","v":""},null,{"$f":"+IF(AND($A76<>\"\",$O76=\"YES\"),COUNTIF($O$19:$O76,\"YES\")&\".YC\",\"\")","v":""},""]
[{"$f":"IF($B77=\"\",\"\",$B77&\".\" &COUNTIFS($B$20:$B77,$B77))","v":""},{"$f":"IF(AND($A$10=\"YES\", COUNTIFS($B$19:$B76,Table!$B$7)<Table!$B$5),Table!$B$7,IF(AND($C$10=\"YES\", COUNTIFS($B$19:$B76,Table!$C$7)<Table!$C$5),Table!$C$7, IF(AND($D$10=\"YES\", COUNTIFS($B$19:$B76,Table!$D$7)<Table!$D$5),Table!$D$7, IF(AND($E$10=\"YES\", COUNTIFS($B$19:$B76,Table!$E$7)<Table!$E$5),Table!$E$7, IF(AND($F$10=\"YES\", COUNTIFS($B$19:$B76,Table!$F$7)<Table!$F$5),Table!$F$7,\"\")))))","v":""},{"$f":"+IF($A77=\"\",\"\",VLOOKUP($A77,Table!$A$20:$L$185,C$2,0))","v":""},{"$f":"+IF($A77=\"\",\"\",VLOOKUP($A77,Table!$A$20:$L$185,D$2,0)&\"\")","v":""},{"$f":"+IF($A77=\"\",\"\",VLOOKUP($A77,Table!$A$20:$L$185,E$2,0))","v":""},{"$f":"+IF($A77=\"\",\"\",VLOOKUP($A77,Table!$A$20:$L$185,F$2,0)&\"\")","v":""},{"$f":"+IF($A77=\"\",\"\",VLOOKUP($A77,Table!$A$20:$L$185,G$2,0))","v":""},{"$f":"+IF($A77=\"\",\"\",VLOOKUP($A77,Table!$A$20:$L$185,H$2,0)&\"\")","v":""},null,{"$f":"+IF($A77=\"\",\"\",VLOOKUP($A77,Table!$A$20:$L$185,J$2,0))","v":""},{"$f":"+IF($A77=\"\",\"\",VLOOKUP($A77,Table!$A$20:$L$185,K$2,0))","v":""},{"$f":"+IF($A77=\"\",\"\",VLOOKUP($A77,Table!$A$20:$L$185,L$2,0))","v":""},null,{"$f":"+IF($A77=\"\",\"\",VLOOKUP($A77,Table!$A$20:$L$185,N$2,0))","v":""},null,{"$f":"+IF(AND($A77<>\"\",$O77=\"YES\"),COUNTIF($O$19:$O77,\"YES\")&\".YC\",\"\")","v":""},""]
[{"$f":"IF($B78=\"\",\"\",$B78&\".\" &COUNTIFS($B$20:$B78,$B78))","v":""},{"$f":"IF(AND($A$10=\"YES\", COUNTIFS($B$19:$B77,Table!$B$7)<Table!$B$5),Table!$B$7,IF(AND($C$10=\"YES\", COUNTIFS($B$19:$B77,Table!$C$7)<Table!$C$5),Table!$C$7, IF(AND($D$10=\"YES\", COUNTIFS($B$19:$B77,Table!$D$7)<Table!$D$5),Table!$D$7, IF(AND($E$10=\"YES\", COUNTIFS($B$19:$B77,Table!$E$7)<Table!$E$5),Table!$E$7, IF(AND($F$10=\"YES\", COUNTIFS($B$19:$B77,Table!$F$7)<Table!$F$5),Table!$F$7,\"\")))))","v":""},{"$f":"+IF($A78=\"\",\"\",VLOOKUP($A78,Table!$A$20:$L$185,C$2,0))","v":""},{"$f":"+IF($A78=\"\",\"\",VLOOKUP($A78,Table!$A$20:$L$185,D$2,0)&\"\")","v":""},{"$f":"+IF($A78=\"\",\"\",VLOOKUP($A78,Table!$A$20:$L$185,E$2,0))","v":""},{"$f":"+IF($A78=\"\",\"\",VLOOKUP($A78,Table!$A$20:$L$185,F$2,0)&\"\")","v":""},{"$f":"+IF($A78=\"\",\"\",VLOOKUP($A78,Table!$A$20:$L$185,G$2,0))","v":""},{"$f":"+IF($A78=\"\",\"\",VLOOKUP($A78,Table!$A$20:$L$185,H$2,0)&\"\")","v":""},null,{"$f":"+IF($A78=\"\",\"\",VLOOKUP($A78,Table!$A$20:$L$185,J$2,0))","v":""},{"$f":"+IF($A78=\"\",\"\",VLOOKUP($A78,Table!$A$20:$L$185,K$2,0))","v":""},{"$f":"+IF($A78=\"\",\"\",VLOOKUP($A78,Table!$A$20:$L$185,L$2,0))","v":""},null,{"$f":"+IF($A78=\"\",\"\",VLOOKUP($A78,Table!$A$20:$L$185,N$2,0))","v":""},null,{"$f":"+IF(AND($A78<>\"\",$O78=\"YES\"),COUNTIF($O$19:$O78,\"YES\")&\".YC\",\"\")","v":""},""]
[{"$f":"IF($B79=\"\",\"\",$B79&\".\" &COUNTIFS($B$20:$B79,$B79))","v":""},{"$f":"IF(AND($A$10=\"YES\", COUNTIFS($B$19:$B78,Table!$B$7)<Table!$B$5),Table!$B$7,IF(AND($C$10=\"YES\", COUNTIFS($B$19:$B78,Table!$C$7)<Table!$C$5),Table!$C$7, IF(AND($D$10=\"YES\", COUNTIFS($B$19:$B78,Table!$D$7)<Table!$D$5),Table!$D$7, IF(AND($E$10=\"YES\", COUNTIFS($B$19:$B78,Table!$E$7)<Table!$E$5),Table!$E$7, IF(AND($F$10=\"YES\", COUNTIFS($B$19:$B78,Table!$F$7)<Table!$F$5),Table!$F$7,\"\")))))","v":""},{"$f":"+IF($A79=\"\",\"\",VLOOKUP($A79,Table!$A$20:$L$185,C$2,0))","v":""},{"$f":"+IF($A79=\"\",\"\",VLOOKUP($A79,Table!$A$20:$L$185,D$2,0)&\"\")","v":""},{"$f":"+IF($A79=\"\",\"\",VLOOKUP($A79,Table!$A$20:$L$185,E$2,0))","v":""},{"$f":"+IF($A79=\"\",\"\",VLOOKUP($A79,Table!$A$20:$L$185,F$2,0)&\"\")","v":""},{"$f":"+IF($A79=\"\",\"\",VLOOKUP($A79,Table!$A$20:$L$185,G$2,0))","v":""},{"$f":"+IF($A79=\"\",\"\",VLOOKUP($A79,Table!$A$20:$L$185,H$2,0)&\"\")","v":""},null,{"$f":"+IF($A79=\"\",\"\",VLOOKUP($A79,Table!$A$20:$L$185,J$2,0))","v":""},{"$f":"+IF($A79=\"\",\"\",VLOOKUP($A79,Table!$A$20:$L$185,K$2,0))","v":""},{"$f":"+IF($A79=\"\",\"\",VLOOKUP($A79,Table!$A$20:$L$185,L$2,0))","v":""},null,{"$f":"+IF($A79=\"\",\"\",VLOOKUP($A79,Table!$A$20:$L$185,N$2,0))","v":""},null,{"$f":"+IF(AND($A79<>\"\",$O79=\"YES\"),COUNTIF($O$19:$O79,\"YES\")&\".YC\",\"\")","v":""},""]
[{"$f":"IF($B80=\"\",\"\",$B80&\".\" &COUNTIFS($B$20:$B80,$B80))","v":""},{"$f":"IF(AND($A$10=\"YES\", COUNTIFS($B$19:$B79,Table!$B$7)<Table!$B$5),Table!$B$7,IF(AND($C$10=\"YES\", COUNTIFS($B$19:$B79,Table!$C$7)<Table!$C$5),Table!$C$7, IF(AND($D$10=\"YES\", COUNTIFS($B$19:$B79,Table!$D$7)<Table!$D$5),Table!$D$7, IF(AND($E$10=\"YES\", COUNTIFS($B$19:$B79,Table!$E$7)<Table!$E$5),Table!$E$7, IF(AND($F$10=\"YES\", COUNTIFS($B$19:$B79,Table!$F$7)<Table!$F$5),Table!$F$7,\"\")))))","v":""},{"$f":"+IF($A80=\"\",\"\",VLOOKUP($A80,Table!$A$20:$L$185,C$2,0))","v":""},{"$f":"+IF($A80=\"\",\"\",VLOOKUP($A80,Table!$A$20:$L$185,D$2,0)&\"\")","v":""},{"$f":"+IF($A80=\"\",\"\",VLOOKUP($A80,Table!$A$20:$L$185,E$2,0))","v":""},{"$f":"+IF($A80=\"\",\"\",VLOOKUP($A80,Table!$A$20:$L$185,F$2,0)&\"\")","v":""},{"$f":"+IF($A80=\"\",\"\",VLOOKUP($A80,Table!$A$20:$L$185,G$2,0))","v":""},{"$f":"+IF($A80=\"\",\"\",VLOOKUP($A80,Table!$A$20:$L$185,H$2,0)&\"\")","v":""},null,{"$f":"+IF($A80=\"\",\"\",VLOOKUP($A80,Table!$A$20:$L$185,J$2,0))","v":""},{"$f":"+IF($A80=\"\",\"\",VLOOKUP($A80,Table!$A$20:$L$185,K$2,0))","v":""},{"$f":"+IF($A80=\"\",\"\",VLOOKUP($A80,Table!$A$20:$L$185,L$2,0))","v":""},null,{"$f":"+IF($A80=\"\",\"\",VLOOKUP($A80,Table!$A$20:$L$185,N$2,0))","v":""},null,{"$f":"+IF(AND($A80<>\"\",$O80=\"YES\"),COUNTIF($O$19:$O80,\"YES\")&\".YC\",\"\")","v":""},""]
[{"$f":"IF($B81=\"\",\"\",$B81&\".\" &COUNTIFS($B$20:$B81,$B81))","v":""},{"$f":"IF(AND($A$10=\"YES\", COUNTIFS($B$19:$B80,Table!$B$7)<Table!$B$5),Table!$B$7,IF(AND($C$10=\"YES\", COUNTIFS($B$19:$B80,Table!$C$7)<Table!$C$5),Table!$C$7, IF(AND($D$10=\"YES\", COUNTIFS($B$19:$B80,Table!$D$7)<Table!$D$5),Table!$D$7, IF(AND($E$10=\"YES\", COUNTIFS($B$19:$B80,Table!$E$7)<Table!$E$5),Table!$E$7, IF(AND($F$10=\"YES\", COUNTIFS($B$19:$B80,Table!$F$7)<Table!$F$5),Table!$F$7,\"\")))))","v":""},{"$f":"+IF($A81=\"\",\"\",VLOOKUP($A81,Table!$A$20:$L$185,C$2,0))","v":""},{"$f":"+IF($A81=\"\",\"\",VLOOKUP($A81,Table!$A$20:$L$185,D$2,0)&\"\")","v":""},{"$f":"+IF($A81=\"\",\"\",VLOOKUP($A81,Table!$A$20:$L$185,E$2,0))","v":""},{"$f":"+IF($A81=\"\",\"\",VLOOKUP($A81,Table!$A$20:$L$185,F$2,0)&\"\")","v":""},{"$f":"+IF($A81=\"\",\"\",VLOOKUP($A81,Table!$A$20:$L$185,G$2,0))","v":""},{"$f":"+IF($A81=\"\",\"\",VLOOKUP($A81,Table!$A$20:$L$185,H$2,0)&\"\")","v":""},null,{"$f":"+IF($A81=\"\",\"\",VLOOKUP($A81,Table!$A$20:$L$185,J$2,0))","v":""},{"$f":"+IF($A81=\"\",\"\",VLOOKUP($A81,Table!$A$20:$L$185,K$2,0))","v":""},{"$f":"+IF($A81=\"\",\"\",VLOOKUP($A81,Table!$A$20:$L$185,L$2,0))","v":""},null,{"$f":"+IF($A81=\"\",\"\",VLOOKUP($A81,Table!$A$20:$L$185,N$2,0))","v":""},null,{"$f":"+IF(AND($A81<>\"\",$O81=\"YES\"),COUNTIF($O$19:$O81,\"YES\")&\".YC\",\"\")","v":""},""]
[{"$f":"IF($B82=\"\",\"\",$B82&\".\" &COUNTIFS($B$20:$B82,$B82))","v":""},{"$f":"IF(AND($A$10=\"YES\", COUNTIFS($B$19:$B81,Table!$B$7)<Table!$B$5),Table!$B$7,IF(AND($C$10=\"YES\", COUNTIFS($B$19:$B81,Table!$C$7)<Table!$C$5),Table!$C$7, IF(AND($D$10=\"YES\", COUNTIFS($B$19:$B81,Table!$D$7)<Table!$D$5),Table!$D$7, IF(AND($E$10=\"YES\", COUNTIFS($B$19:$B81,Table!$E$7)<Table!$E$5),Table!$E$7, IF(AND($F$10=\"YES\", COUNTIFS($B$19:$B81,Table!$F$7)<Table!$F$5),Table!$F$7,\"\")))))","v":""},{"$f":"+IF($A82=\"\",\"\",VLOOKUP($A82,Table!$A$20:$L$185,C$2,0))","v":""},{"$f":"+IF($A82=\"\",\"\",VLOOKUP($A82,Table!$A$20:$L$185,D$2,0)&\"\")","v":""},{"$f":"+IF($A82=\"\",\"\",VLOOKUP($A82,Table!$A$20:$L$185,E$2,0))","v":""},{"$f":"+IF($A82=\"\",\"\",VLOOKUP($A82,Table!$A$20:$L$185,F$2,0)&\"\")","v":""},{"$f":"+IF($A82=\"\",\"\",VLOOKUP($A82,Table!$A$20:$L$185,G$2,0))","v":""},{"$f":"+IF($A82=\"\",\"\",VLOOKUP($A82,Table!$A$20:$L$185,H$2,0)&\"\")","v":""},null,{"$f":"+IF($A82=\"\",\"\",VLOOKUP($A82,Table!$A$20:$L$185,J$2,0))","v":""},{"$f":"+IF($A82=\"\",\"\",VLOOKUP($A82,Table!$A$20:$L$185,K$2,0))","v":""},{"$f":"+IF($A82=\"\",\"\",VLOOKUP($A82,Table!$A$20:$L$185,L$2,0))","v":""},null,{"$f":"+IF($A82=\"\",\"\",VLOOKUP($A82,Table!$A$20:$L$185,N$2,0))","v":""},null,{"$f":"+IF(AND($A82<>\"\",$O82=\"YES\"),COUNTIF($O$19:$O82,\"YES\")&\".YC\",\"\")","v":""},""]
[{"$f":"IF($B83=\"\",\"\",$B83&\".\" &COUNTIFS($B$20:$B83,$B83))","v":""},{"$f":"IF(AND($A$10=\"YES\", COUNTIFS($B$19:$B82,Table!$B$7)<Table!$B$5),Table!$B$7,IF(AND($C$10=\"YES\", COUNTIFS($B$19:$B82,Table!$C$7)<Table!$C$5),Table!$C$7, IF(AND($D$10=\"YES\", COUNTIFS($B$19:$B82,Table!$D$7)<Table!$D$5),Table!$D$7, IF(AND($E$10=\"YES\", COUNTIFS($B$19:$B82,Table!$E$7)<Table!$E$5),Table!$E$7, IF(AND($F$10=\"YES\", COUNTIFS($B$19:$B82,Table!$F$7)<Table!$F$5),Table!$F$7,\"\")))))","v":""},{"$f":"+IF($A83=\"\",\"\",VLOOKUP($A83,Table!$A$20:$L$185,C$2,0))","v":""},{"$f":"+IF($A83=\"\",\"\",VLOOKUP($A83,Table!$A$20:$L$185,D$2,0)&\"\")","v":""},{"$f":"+IF($A83=\"\",\"\",VLOOKUP($A83,Table!$A$20:$L$185,E$2,0))","v":""},{"$f":"+IF($A83=\"\",\"\",VLOOKUP($A83,Table!$A$20:$L$185,F$2,0)&\"\")","v":""},{"$f":"+IF($A83=\"\",\"\",VLOOKUP($A83,Table!$A$20:$L$185,G$2,0))","v":""},{"$f":"+IF($A83=\"\",\"\",VLOOKUP($A83,Table!$A$20:$L$185,H$2,0)&\"\")","v":""},null,{"$f":"+IF($A83=\"\",\"\",VLOOKUP($A83,Table!$A$20:$L$185,J$2,0))","v":""},{"$f":"+IF($A83=\"\",\"\",VLOOKUP($A83,Table!$A$20:$L$185,K$2,0))","v":""},{"$f":"+IF($A83=\"\",\"\",VLOOKUP($A83,Table!$A$20:$L$185,L$2,0))","v":""},null,{"$f":"+IF($A83=\"\",\"\",VLOOKUP($A83,Table!$A$20:$L$185,N$2,0))","v":""},null,{"$f":"+IF(AND($A83<>\"\",$O83=\"YES\"),COUNTIF($O$19:$O83,\"YES\")&\".YC\",\"\")","v":""},""]
[{"$f":"IF($B84=\"\",\"\",$B84&\".\" &COUNTIFS($B$20:$B84,$B84))","v":""},{"$f":"IF(AND($A$10=\"YES\", COUNTIFS($B$19:$B83,Table!$B$7)<Table!$B$5),Table!$B$7,IF(AND($C$10=\"YES\", COUNTIFS($B$19:$B83,Table!$C$7)<Table!$C$5),Table!$C$7, IF(AND($D$10=\"YES\", COUNTIFS($B$19:$B83,Table!$D$7)<Table!$D$5),Table!$D$7, IF(AND($E$10=\"YES\", COUNTIFS($B$19:$B83,Table!$E$7)<Table!$E$5),Table!$E$7, IF(AND($F$10=\"YES\", COUNTIFS($B$19:$B83,Table!$F$7)<Table!$F$5),Table!$F$7,\"\")))))","v":""},{"$f":"+IF($A84=\"\",\"\",VLOOKUP($A84,Table!$A$20:$L$185,C$2,0))","v":""},{"$f":"+IF($A84=\"\",\"\",VLOOKUP($A84,Table!$A$20:$L$185,D$2,0)&\"\")","v":""},{"$f":"+IF($A84=\"\",\"\",VLOOKUP($A84,Table!$A$20:$L$185,E$2,0))","v":""},{"$f":"+IF($A84=\"\",\"\",VLOOKUP($A84,Table!$A$20:$L$185,F$2,0)&\"\")","v":""},{"$f":"+IF($A84=\"\",\"\",VLOOKUP($A84,Table!$A$20:$L$185,G$2,0))","v":""},{"$f":"+IF($A84=\"\",\"\",VLOOKUP($A84,Table!$A$20:$L$185,H$2,0)&\"\")","v":""},null,{"$f":"+IF($A84=\"\",\"\",VLOOKUP($A84,Table!$A$20:$L$185,J$2,0))","v":""},{"$f":"+IF($A84=\"\",\"\",VLOOKUP($A84,Table!$A$20:$L$185,K$2,0))","v":""},{"$f":"+IF($A84=\"\",\"\",VLOOKUP($A84,Table!$A$20:$L$185,L$2,0))","v":""},null,{"$f":"+IF($A84=\"\",\"\",VLOOKUP($A84,Table!$A$20:$L$185,N$2,0))","v":""},null,{"$f":"+IF(AND($A84<>\"\",$O84=\"YES\"),COUNTIF($O$19:$O84,\"YES\")&\".YC\",\"\")","v":""},""]
[{"$f":"IF($B85=\"\",\"\",$B85&\".\" &COUNTIFS($B$20:$B85,$B85))","v":""},{"$f":"IF(AND($A$10=\"YES\", COUNTIFS($B$19:$B84,Table!$B$7)<Table!$B$5),Table!$B$7,IF(AND($C$10=\"YES\", COUNTIFS($B$19:$B84,Table!$C$7)<Table!$C$5),Table!$C$7, IF(AND($D$10=\"YES\", COUNTIFS($B$19:$B84,Table!$D$7)<Table!$D$5),Table!$D$7, IF(AND($E$10=\"YES\", COUNTIFS($B$19:$B84,Table!$E$7)<Table!$E$5),Table!$E$7, IF(AND($F$10=\"YES\", COUNTIFS($B$19:$B84,Table!$F$7)<Table!$F$5),Table!$F$7,\"\")))))","v":""},{"$f":"+IF($A85=\"\",\"\",VLOOKUP($A85,Table!$A$20:$L$185,C$2,0))","v":""},{"$f":"+IF($A85=\"\",\"\",VLOOKUP($A85,Table!$A$20:$L$185,D$2,0)&\"\")","v":""},{"$f":"+IF($A85=\"\",\"\",VLOOKUP($A85,Table!$A$20:$L$185,E$2,0))","v":""},{"$f":"+IF($A85=\"\",\"\",VLOOKUP($A85,Table!$A$20:$L$185,F$2,0)&\"\")","v":""},{"$f":"+IF($A85=\"\",\"\",VLOOKUP($A85,Table!$A$20:$L$185,G$2,0))","v":""},{"$f":"+IF($A85=\"\",\"\",VLOOKUP($A85,Table!$A$20:$L$185,H$2,0)&\"\")","v":""},null,{"$f":"+IF($A85=\"\",\"\",VLOOKUP($A85,Table!$A$20:$L$185,J$2,0))","v":""},{"$f":"+IF($A85=\"\",\"\",VLOOKUP($A85,Table!$A$20:$L$185,K$2,0))","v":""},{"$f":"+IF($A85=\"\",\"\",VLOOKUP($A85,Table!$A$20:$L$185,L$2,0))","v":""},null,{"$f":"+IF($A85=\"\",\"\",VLOOKUP($A85,Table!$A$20:$L$185,N$2,0))","v":""},null,{"$f":"+IF(AND($A85<>\"\",$O85=\"YES\"),COUNTIF($O$19:$O85,\"YES\")&\".YC\",\"\")","v":""},""]
[{"$f":"IF($B86=\"\",\"\",$B86&\".\" &COUNTIFS($B$20:$B86,$B86))","v":""},{"$f":"IF(AND($A$10=\"YES\", COUNTIFS($B$19:$B85,Table!$B$7)<Table!$B$5),Table!$B$7,IF(AND($C$10=\"YES\", COUNTIFS($B$19:$B85,Table!$C$7)<Table!$C$5),Table!$C$7, IF(AND($D$10=\"YES\", COUNTIFS($B$19:$B85,Table!$D$7)<Table!$D$5),Table!$D$7, IF(AND($E$10=\"YES\", COUNTIFS($B$19:$B85,Table!$E$7)<Table!$E$5),Table!$E$7, IF(AND($F$10=\"YES\", COUNTIFS($B$19:$B85,Table!$F$7)<Table!$F$5),Table!$F$7,\"\")))))","v":""},{"$f":"+IF($A86=\"\",\"\",VLOOKUP($A86,Table!$A$20:$L$185,C$2,0))","v":""},{"$f":"+IF($A86=\"\",\"\",VLOOKUP($A86,Table!$A$20:$L$185,D$2,0)&\"\")","v":""},{"$f":"+IF($A86=\"\",\"\",VLOOKUP($A86,Table!$A$20:$L$185,E$2,0))","v":""},{"$f":"+IF($A86=\"\",\"\",VLOOKUP($A86,Table!$A$20:$L$185,F$2,0)&\"\")","v":""},{"$f":"+IF($A86=\"\",\"\",VLOOKUP($A86,Table!$A$20:$L$185,G$2,0))","v":""},{"$f":"+IF($A86=\"\",\"\",VLOOKUP($A86,Table!$A$20:$L$185,H$2,0)&\"\")","v":""},null,{"$f":"+IF($A86=\"\",\"\",VLOOKUP($A86,Table!$A$20:$L$185,J$2,0))","v":""},{"$f":"+IF($A86=\"\",\"\",VLOOKUP($A86,Table!$A$20:$L$185,K$2,0))","v":""},{"$f":"+IF($A86=\"\",\"\",VLOOKUP($A86,Table!$A$20:$L$185,L$2,0))","v":""},null,{"$f":"+IF($A86=\"\",\"\",VLOOKUP($A86,Table!$A$20:$L$185,N$2,0))","v":""},null,{"$f":"+IF(AND($A86<>\"\",$O86=\"YES\"),COUNTIF($O$19:$O86,\"YES\")&\".YC\",\"\")","v":""},{"$f":"+IF(AND($A86<>\"\",$O86=\"YES\"),$A86,\"\")","v":""}]
[{"$f":"IF($B87=\"\",\"\",$B87&\".\" &COUNTIFS($B$20:$B87,$B87))","v":""},{"$f":"IF(AND($A$10=\"YES\", COUNTIFS($B$19:$B86,Table!$B$7)<Table!$B$5),Table!$B$7,IF(AND($C$10=\"YES\", COUNTIFS($B$19:$B86,Table!$C$7)<Table!$C$5),Table!$C$7, IF(AND($D$10=\"YES\", COUNTIFS($B$19:$B86,Table!$D$7)<Table!$D$5),Table!$D$7, IF(AND($E$10=\"YES\", COUNTIFS($B$19:$B86,Table!$E$7)<Table!$E$5),Table!$E$7, IF(AND($F$10=\"YES\", COUNTIFS($B$19:$B86,Table!$F$7)<Table!$F$5),Table!$F$7,\"\")))))","v":""},{"$f":"+IF($A87=\"\",\"\",VLOOKUP($A87,Table!$A$20:$L$185,C$2,0))","v":""},{"$f":"+IF($A87=\"\",\"\",VLOOKUP($A87,Table!$A$20:$L$185,D$2,0)&\"\")","v":""},{"$f":"+IF($A87=\"\",\"\",VLOOKUP($A87,Table!$A$20:$L$185,E$2,0))","v":""},{"$f":"+IF($A87=\"\",\"\",VLOOKUP($A87,Table!$A$20:$L$185,F$2,0)&\"\")","v":""},{"$f":"+IF($A87=\"\",\"\",VLOOKUP($A87,Table!$A$20:$L$185,G$2,0))","v":""},{"$f":"+IF($A87=\"\",\"\",VLOOKUP($A87,Table!$A$20:$L$185,H$2,0)&\"\")","v":""},null,{"$f":"+IF($A87=\"\",\"\",VLOOKUP($A87,Table!$A$20:$L$185,J$2,0))","v":""},{"$f":"+IF($A87=\"\",\"\",VLOOKUP($A87,Table!$A$20:$L$185,K$2,0))","v":""},{"$f":"+IF($A87=\"\",\"\",VLOOKUP($A87,Table!$A$20:$L$185,L$2,0))","v":""},null,{"$f":"+IF($A87=\"\",\"\",VLOOKUP($A87,Table!$A$20:$L$185,N$2,0))","v":""},null,{"$f":"+IF(AND($A87<>\"\",$O87=\"YES\"),COUNTIF($O$19:$O87,\"YES\")&\".YC\",\"\")","v":""},{"$f":"+IF(AND($A87<>\"\",$O87=\"YES\"),$A87,\"\")","v":""}]
[{"$f":"IF($B88=\"\",\"\",$B88&\".\" &COUNTIFS($B$20:$B88,$B88))","v":""},{"$f":"IF(AND($A$10=\"YES\", COUNTIFS($B$19:$B87,Table!$B$7)<Table!$B$5),Table!$B$7,IF(AND($C$10=\"YES\", COUNTIFS($B$19:$B87,Table!$C$7)<Table!$C$5),Table!$C$7, IF(AND($D$10=\"YES\", COUNTIFS($B$19:$B87,Table!$D$7)<Table!$D$5),Table!$D$7, IF(AND($E$10=\"YES\", COUNTIFS($B$19:$B87,Table!$E$7)<Table!$E$5),Table!$E$7, IF(AND($F$10=\"YES\", COUNTIFS($B$19:$B87,Table!$F$7)<Table!$F$5),Table!$F$7,\"\")))))","v":""},{"$f":"+IF($A88=\"\",\"\",VLOOKUP($A88,Table!$A$20:$L$185,C$2,0))","v":""},{"$f":"+IF($A88=\"\",\"\",VLOOKUP($A88,Table!$A$20:$L$185,D$2,0)&\"\")","v":""},{"$f":"+IF($A88=\"\",\"\",VLOOKUP($A88,Table!$A$20:$L$185,E$2,0))","v":""},{"$f":"+IF($A88=\"\",\"\",VLOOKUP($A88,Table!$A$20:$L$185,F$2,0)&\"\")","v":""},{"$f":"+IF($A88=\"\",\"\",VLOOKUP($A88,Table!$A$20:$L$185,G$2,0))","v":""},{"$f":"+IF($A88=\"\",\"\",VLOOKUP($A88,Table!$A$20:$L$185,H$2,0)&\"\")","v":""},null,{"$f":"+IF($A88=\"\",\"\",VLOOKUP($A88,Table!$A$20:$L$185,J$2,0))","v":""},{"$f":"+IF($A88=\"\",\"\",VLOOKUP($A88,Table!$A$20:$L$185,K$2,0))","v":""},{"$f":"+IF($A88=\"\",\"\",VLOOKUP($A88,Table!$A$20:$L$185,L$2,0))","v":""},null,{"$f":"+IF($A88=\"\",\"\",VLOOKUP($A88,Table!$A$20:$L$185,N$2,0))","v":""},null,{"$f":"+IF(AND($A88<>\"\",$O88=\"YES\"),COUNTIF($O$19:$O88,\"YES\")&\".YC\",\"\")","v":""},{"$f":"+IF(AND($A88<>\"\",$O88=\"YES\"),$A88,\"\")","v":""}]
[{"$f":"IF($B89=\"\",\"\",$B89&\".\" &COUNTIFS($B$20:$B89,$B89))","v":""},{"$f":"IF(AND($A$10=\"YES\", COUNTIFS($B$19:$B88,Table!$B$7)<Table!$B$5),Table!$B$7,IF(AND($C$10=\"YES\", COUNTIFS($B$19:$B88,Table!$C$7)<Table!$C$5),Table!$C$7, IF(AND($D$10=\"YES\", COUNTIFS($B$19:$B88,Table!$D$7)<Table!$D$5),Table!$D$7, IF(AND($E$10=\"YES\", COUNTIFS($B$19:$B88,Table!$E$7)<Table!$E$5),Table!$E$7, IF(AND($F$10=\"YES\", COUNTIFS($B$19:$B88,Table!$F$7)<Table!$F$5),Table!$F$7,\"\")))))","v":""},{"$f":"+IF($A89=\"\",\"\",VLOOKUP($A89,Table!$A$20:$L$185,C$2,0))","v":""},{"$f":"+IF($A89=\"\",\"\",VLOOKUP($A89,Table!$A$20:$L$185,D$2,0)&\"\")","v":""},{"$f":"+IF($A89=\"\",\"\",VLOOKUP($A89,Table!$A$20:$L$185,E$2,0))","v":""},{"$f":"+IF($A89=\"\",\"\",VLOOKUP($A89,Table!$A$20:$L$185,F$2,0)&\"\")","v":""},{"$f":"+IF($A89=\"\",\"\",VLOOKUP($A89,Table!$A$20:$L$185,G$2,0))","v":""},{"$f":"+IF($A89=\"\",\"\",VLOOKUP($A89,Table!$A$20:$L$185,H$2,0)&\"\")","v":""},null,{"$f":"+IF($A89=\"\",\"\",VLOOKUP($A89,Table!$A$20:$L$185,J$2,0))","v":""},{"$f":"+IF($A89=\"\",\"\",VLOOKUP($A89,Table!$A$20:$L$185,K$2,0))","v":""},{"$f":"+IF($A89=\"\",\"\",VLOOKUP($A89,Table!$A$20:$L$185,L$2,0))","v":""},null,{"$f":"+IF($A89=\"\",\"\",VLOOKUP($A89,Table!$A$20:$L$185,N$2,0))","v":""},null,{"$f":"+IF(AND($A89<>\"\",$O89=\"YES\"),COUNTIF($O$19:$O89,\"YES\")&\".YC\",\"\")","v":""},{"$f":"+IF(AND($A89<>\"\",$O89=\"YES\"),$A89,\"\")","v":""}]
[{"$f":"IF($B90=\"\",\"\",$B90&\".\" &COUNTIFS($B$20:$B90,$B90))","v":""},{"$f":"IF(AND($A$10=\"YES\", COUNTIFS($B$19:$B89,Table!$B$7)<Table!$B$5),Table!$B$7,IF(AND($C$10=\"YES\", COUNTIFS($B$19:$B89,Table!$C$7)<Table!$C$5),Table!$C$7, IF(AND($D$10=\"YES\", COUNTIFS($B$19:$B89,Table!$D$7)<Table!$D$5),Table!$D$7, IF(AND($E$10=\"YES\", COUNTIFS($B$19:$B89,Table!$E$7)<Table!$E$5),Table!$E$7, IF(AND($F$10=\"YES\", COUNTIFS($B$19:$B89,Table!$F$7)<Table!$F$5),Table!$F$7,\"\")))))","v":""},{"$f":"+IF($A90=\"\",\"\",VLOOKUP($A90,Table!$A$20:$L$185,C$2,0))","v":""},{"$f":"+IF($A90=\"\",\"\",VLOOKUP($A90,Table!$A$20:$L$185,D$2,0)&\"\")","v":""},{"$f":"+IF($A90=\"\",\"\",VLOOKUP($A90,Table!$A$20:$L$185,E$2,0))","v":""},{"$f":"+IF($A90=\"\",\"\",VLOOKUP($A90,Table!$A$20:$L$185,F$2,0)&\"\")","v":""},{"$f":"+IF($A90=\"\",\"\",VLOOKUP($A90,Table!$A$20:$L$185,G$2,0))","v":""},{"$f":"+IF($A90=\"\",\"\",VLOOKUP($A90,Table!$A$20:$L$185,H$2,0)&\"\")","v":""},null,{"$f":"+IF($A90=\"\",\"\",VLOOKUP($A90,Table!$A$20:$L$185,J$2,0))","v":""},{"$f":"+IF($A90=\"\",\"\",VLOOKUP($A90,Table!$A$20:$L$185,K$2,0))","v":""},{"$f":"+IF($A90=\"\",\"\",VLOOKUP($A90,Table!$A$20:$L$185,L$2,0))","v":""},null,{"$f":"+IF($A90=\"\",\"\",VLOOKUP($A90,Table!$A$20:$L$185,N$2,0))","v":""},null,{"$f":"+IF(AND($A90<>\"\",$O90=\"YES\"),COUNTIF($O$19:$O90,\"YES\")&\".YC\",\"\")","v":""},{"$f":"+IF(AND($A90<>\"\",$O90=\"YES\"),$A90,\"\")","v":""}]
[{"$f":"IF($B91=\"\",\"\",$B91&\".\" &COUNTIFS($B$20:$B91,$B91))","v":""},{"$f":"IF(AND($A$10=\"YES\", COUNTIFS($B$19:$B90,Table!$B$7)<Table!$B$5),Table!$B$7,IF(AND($C$10=\"YES\", COUNTIFS($B$19:$B90,Table!$C$7)<Table!$C$5),Table!$C$7, IF(AND($D$10=\"YES\", COUNTIFS($B$19:$B90,Table!$D$7)<Table!$D$5),Table!$D$7, IF(AND($E$10=\"YES\", COUNTIFS($B$19:$B90,Table!$E$7)<Table!$E$5),Table!$E$7, IF(AND($F$10=\"YES\", COUNTIFS($B$19:$B90,Table!$F$7)<Table!$F$5),Table!$F$7,\"\")))))","v":""},{"$f":"+IF($A91=\"\",\"\",VLOOKUP($A91,Table!$A$20:$L$185,C$2,0))","v":""},{"$f":"+IF($A91=\"\",\"\",VLOOKUP($A91,Table!$A$20:$L$185,D$2,0)&\"\")","v":""},{"$f":"+IF($A91=\"\",\"\",VLOOKUP($A91,Table!$A$20:$L$185,E$2,0))","v":""},{"$f":"+IF($A91=\"\",\"\",VLOOKUP($A91,Table!$A$20:$L$185,F$2,0)&\"\")","v":""},{"$f":"+IF($A91=\"\",\"\",VLOOKUP($A91,Table!$A$20:$L$185,G$2,0))","v":""},{"$f":"+IF($A91=\"\",\"\",VLOOKUP($A91,Table!$A$20:$L$185,H$2,0)&\"\")","v":""},null,{"$f":"+IF($A91=\"\",\"\",VLOOKUP($A91,Table!$A$20:$L$185,J$2,0))","v":""},{"$f":"+IF($A91=\"\",\"\",VLOOKUP($A91,Table!$A$20:$L$185,K$2,0))","v":""},{"$f":"+IF($A91=\"\",\"\",VLOOKUP($A91,Table!$A$20:$L$185,L$2,0))","v":""},null,{"$f":"+IF($A91=\"\",\"\",VLOOKUP($A91,Table!$A$20:$L$185,N$2,0))","v":""},null,{"$f":"+IF(AND($A91<>\"\",$O91=\"YES\"),COUNTIF($O$19:$O91,\"YES\")&\".YC\",\"\")","v":""},""]
[{"$f":"IF($B92=\"\",\"\",$B92&\".\" &COUNTIFS($B$20:$B92,$B92))","v":""},{"$f":"IF(AND($A$10=\"YES\", COUNTIFS($B$19:$B91,Table!$B$7)<Table!$B$5),Table!$B$7,IF(AND($C$10=\"YES\", COUNTIFS($B$19:$B91,Table!$C$7)<Table!$C$5),Table!$C$7, IF(AND($D$10=\"YES\", COUNTIFS($B$19:$B91,Table!$D$7)<Table!$D$5),Table!$D$7, IF(AND($E$10=\"YES\", COUNTIFS($B$19:$B91,Table!$E$7)<Table!$E$5),Table!$E$7, IF(AND($F$10=\"YES\", COUNTIFS($B$19:$B91,Table!$F$7)<Table!$F$5),Table!$F$7,\"\")))))","v":""},{"$f":"+IF($A92=\"\",\"\",VLOOKUP($A92,Table!$A$20:$L$185,C$2,0))","v":""},{"$f":"+IF($A92=\"\",\"\",VLOOKUP($A92,Table!$A$20:$L$185,D$2,0)&\"\")","v":""},{"$f":"+IF($A92=\"\",\"\",VLOOKUP($A92,Table!$A$20:$L$185,E$2,0))","v":""},{"$f":"+IF($A92=\"\",\"\",VLOOKUP($A92,Table!$A$20:$L$185,F$2,0)&\"\")","v":""},{"$f":"+IF($A92=\"\",\"\",VLOOKUP($A92,Table!$A$20:$L$185,G$2,0))","v":""},{"$f":"+IF($A92=\"\",\"\",VLOOKUP($A92,Table!$A$20:$L$185,H$2,0)&\"\")","v":""},null,{"$f":"+IF($A92=\"\",\"\",VLOOKUP($A92,Table!$A$20:$L$185,J$2,0))","v":""},{"$f":"+IF($A92=\"\",\"\",VLOOKUP($A92,Table!$A$20:$L$185,K$2,0))","v":""},{"$f":"+IF($A92=\"\",\"\",VLOOKUP($A92,Table!$A$20:$L$185,L$2,0))","v":""},null,{"$f":"+IF($A92=\"\",\"\",VLOOKUP($A92,Table!$A$20:$L$185,N$2,0))","v":""},null,{"$f":"+IF(AND($A92<>\"\",$O92=\"YES\"),COUNTIF($O$19:$O92,\"YES\")&\".YC\",\"\")","v":""},""]
[{"$f":"IF($B93=\"\",\"\",$B93&\".\" &COUNTIFS($B$20:$B93,$B93))","v":""},{"$f":"IF(AND($A$10=\"YES\", COUNTIFS($B$19:$B92,Table!$B$7)<Table!$B$5),Table!$B$7,IF(AND($C$10=\"YES\", COUNTIFS($B$19:$B92,Table!$C$7)<Table!$C$5),Table!$C$7, IF(AND($D$10=\"YES\", COUNTIFS($B$19:$B92,Table!$D$7)<Table!$D$5),Table!$D$7, IF(AND($E$10=\"YES\", COUNTIFS($B$19:$B92,Table!$E$7)<Table!$E$5),Table!$E$7, IF(AND($F$10=\"YES\", COUNTIFS($B$19:$B92,Table!$F$7)<Table!$F$5),Table!$F$7,\"\")))))","v":""},{"$f":"+IF($A93=\"\",\"\",VLOOKUP($A93,Table!$A$20:$L$185,C$2,0))","v":""},{"$f":"+IF($A93=\"\",\"\",VLOOKUP($A93,Table!$A$20:$L$185,D$2,0)&\"\")","v":""},{"$f":"+IF($A93=\"\",\"\",VLOOKUP($A93,Table!$A$20:$L$185,E$2,0))","v":""},{"$f":"+IF($A93=\"\",\"\",VLOOKUP($A93,Table!$A$20:$L$185,F$2,0)&\"\")","v":""},{"$f":"+IF($A93=\"\",\"\",VLOOKUP($A93,Table!$A$20:$L$185,G$2,0))","v":""},{"$f":"+IF($A93=\"\",\"\",VLOOKUP($A93,Table!$A$20:$L$185,H$2,0)&\"\")","v":""},null,{"$f":"+IF($A93=\"\",\"\",VLOOKUP($A93,Table!$A$20:$L$185,J$2,0))","v":""},{"$f":"+IF($A93=\"\",\"\",VLOOKUP($A93,Table!$A$20:$L$185,K$2,0))","v":""},{"$f":"+IF($A93=\"\",\"\",VLOOKUP($A93,Table!$A$20:$L$185,L$2,0))","v":""},null,{"$f":"+IF($A93=\"\",\"\",VLOOKUP($A93,Table!$A$20:$L$185,N$2,0))","v":""},null,{"$f":"+IF(AND($A93<>\"\",$O93=\"YES\"),COUNTIF($O$19:$O93,\"YES\")&\".YC\",\"\")","v":""},""]
[{"$f":"IF($B94=\"\",\"\",$B94&\".\" &COUNTIFS($B$20:$B94,$B94))","v":""},{"$f":"IF(AND($A$10=\"YES\", COUNTIFS($B$19:$B93,Table!$B$7)<Table!$B$5),Table!$B$7,IF(AND($C$10=\"YES\", COUNTIFS($B$19:$B93,Table!$C$7)<Table!$C$5),Table!$C$7, IF(AND($D$10=\"YES\", COUNTIFS($B$19:$B93,Table!$D$7)<Table!$D$5),Table!$D$7, IF(AND($E$10=\"YES\", COUNTIFS($B$19:$B93,Table!$E$7)<Table!$E$5),Table!$E$7, IF(AND($F$10=\"YES\", COUNTIFS($B$19:$B93,Table!$F$7)<Table!$F$5),Table!$F$7,\"\")))))","v":""},{"$f":"+IF($A94=\"\",\"\",VLOOKUP($A94,Table!$A$20:$L$185,C$2,0))","v":""},{"$f":"+IF($A94=\"\",\"\",VLOOKUP($A94,Table!$A$20:$L$185,D$2,0)&\"\")","v":""},{"$f":"+IF($A94=\"\",\"\",VLOOKUP($A94,Table!$A$20:$L$185,E$2,0))","v":""},{"$f":"+IF($A94=\"\",\"\",VLOOKUP($A94,Table!$A$20:$L$185,F$2,0)&\"\")","v":""},{"$f":"+IF($A94=\"\",\"\",VLOOKUP($A94,Table!$A$20:$L$185,G$2,0))","v":""},{"$f":"+IF($A94=\"\",\"\",VLOOKUP($A94,Table!$A$20:$L$185,H$2,0)&\"\")","v":""},null,{"$f":"+IF($A94=\"\",\"\",VLOOKUP($A94,Table!$A$20:$L$185,J$2,0))","v":""},{"$f":"+IF($A94=\"\",\"\",VLOOKUP($A94,Table!$A$20:$L$185,K$2,0))","v":""},{"$f":"+IF($A94=\"\",\"\",VLOOKUP($A94,Table!$A$20:$L$185,L$2,0))","v":""},null,{"$f":"+IF($A94=\"\",\"\",VLOOKUP($A94,Table!$A$20:$L$185,N$2,0))","v":""},null,{"$f":"+IF(AND($A94<>\"\",$O94=\"YES\"),COUNTIF($O$19:$O94,\"YES\")&\".YC\",\"\")","v":""},""]
[{"$f":"IF($B95=\"\",\"\",$B95&\".\" &COUNTIFS($B$20:$B95,$B95))","v":""},{"$f":"IF(AND($A$10=\"YES\", COUNTIFS($B$19:$B94,Table!$B$7)<Table!$B$5),Table!$B$7,IF(AND($C$10=\"YES\", COUNTIFS($B$19:$B94,Table!$C$7)<Table!$C$5),Table!$C$7, IF(AND($D$10=\"YES\", COUNTIFS($B$19:$B94,Table!$D$7)<Table!$D$5),Table!$D$7, IF(AND($E$10=\"YES\", COUNTIFS($B$19:$B94,Table!$E$7)<Table!$E$5),Table!$E$7, IF(AND($F$10=\"YES\", COUNTIFS($B$19:$B94,Table!$F$7)<Table!$F$5),Table!$F$7,\"\")))))","v":""},{"$f":"+IF($A95=\"\",\"\",VLOOKUP($A95,Table!$A$20:$L$185,C$2,0))","v":""},{"$f":"+IF($A95=\"\",\"\",VLOOKUP($A95,Table!$A$20:$L$185,D$2,0)&\"\")","v":""},{"$f":"+IF($A95=\"\",\"\",VLOOKUP($A95,Table!$A$20:$L$185,E$2,0))","v":""},{"$f":"+IF($A95=\"\",\"\",VLOOKUP($A95,Table!$A$20:$L$185,F$2,0)&\"\")","v":""},{"$f":"+IF($A95=\"\",\"\",VLOOKUP($A95,Table!$A$20:$L$185,G$2,0))","v":""},{"$f":"+IF($A95=\"\",\"\",VLOOKUP($A95,Table!$A$20:$L$185,H$2,0)&\"\")","v":""},null,{"$f":"+IF($A95=\"\",\"\",VLOOKUP($A95,Table!$A$20:$L$185,J$2,0))","v":""},{"$f":"+IF($A95=\"\",\"\",VLOOKUP($A95,Table!$A$20:$L$185,K$2,0))","v":""},{"$f":"+IF($A95=\"\",\"\",VLOOKUP($A95,Table!$A$20:$L$185,L$2,0))","v":""},null,{"$f":"+IF($A95=\"\",\"\",VLOOKUP($A95,Table!$A$20:$L$185,N$2,0))","v":""},null,{"$f":"+IF(AND($A95<>\"\",$O95=\"YES\"),$A95,\"\")","v":""}]
[{"$f":"IF($B96=\"\",\"\",$B96&\".\" &COUNTIFS($B$20:$B96,$B96))","v":""},{"$f":"IF(AND($A$10=\"YES\", COUNTIFS($B$19:$B95,Table!$B$7)<Table!$B$5),Table!$B$7,IF(AND($C$10=\"YES\", COUNTIFS($B$19:$B95,Table!$C$7)<Table!$C$5),Table!$C$7, IF(AND($D$10=\"YES\", COUNTIFS($B$19:$B95,Table!$D$7)<Table!$D$5),Table!$D$7, IF(AND($E$10=\"YES\", COUNTIFS($B$19:$B95,Table!$E$7)<Table!$E$5),Table!$E$7, IF(AND($F$10=\"YES\", COUNTIFS($B$19:$B95,Table!$F$7)<Table!$F$5),Table!$F$7,\"\")))))","v":""},{"$f":"+IF($A96=\"\",\"\",VLOOKUP($A96,Table!$A$20:$L$185,C$2,0))","v":""},{"$f":"+IF($A96=\"\",\"\",VLOOKUP($A96,Table!$A$20:$L$185,D$2,0)&\"\")","v":""},{"$f":"+IF($A96=\"\",\"\",VLOOKUP($A96,Table!$A$20:$L$185,E$2,0))","v":""},{"$f":"+IF($A96=\"\",\"\",VLOOKUP($A96,Table!$A$20:$L$185,F$2,0)&\"\")","v":""},{"$f":"+IF($A96=\"\",\"\",VLOOKUP($A96,Table!$A$20:$L$185,G$2,0))","v":""},{"$f":"+IF($A96=\"\",\"\",VLOOKUP($A96,Table!$A$20:$L$185,H$2,0)&\"\")","v":""},null,{"$f":"+IF($A96=\"\",\"\",VLOOKUP($A96,Table!$A$20:$L$185,J$2,0))","v":""},{"$f":"+IF($A96=\"\",\"\",VLOOKUP($A96,Table!$A$20:$L$185,K$2,0))","v":""},{"$f":"+IF($A96=\"\",\"\",VLOOKUP($A96,Table!$A$20:$L$185,L$2,0))","v":""},null,{"$f":"+IF($A96=\"\",\"\",VLOOKUP($A96,Table!$A$20:$L$185,N$2,0))","v":""},null,""]
[{"$f":"IF($B97=\"\",\"\",$B97&\".\" &COUNTIFS($B$20:$B97,$B97))","v":""},{"$f":"IF(AND($A$10=\"YES\", COUNTIFS($B$19:$B96,Table!$B$7)<Table!$B$5),Table!$B$7,IF(AND($C$10=\"YES\", COUNTIFS($B$19:$B96,Table!$C$7)<Table!$C$5),Table!$C$7, IF(AND($D$10=\"YES\", COUNTIFS($B$19:$B96,Table!$D$7)<Table!$D$5),Table!$D$7, IF(AND($E$10=\"YES\", COUNTIFS($B$19:$B96,Table!$E$7)<Table!$E$5),Table!$E$7, IF(AND($F$10=\"YES\", COUNTIFS($B$19:$B96,Table!$F$7)<Table!$F$5),Table!$F$7,\"\")))))","v":""},{"$f":"+IF($A97=\"\",\"\",VLOOKUP($A97,Table!$A$20:$L$185,C$2,0))","v":""},{"$f":"+IF($A97=\"\",\"\",VLOOKUP($A97,Table!$A$20:$L$185,D$2,0)&\"\")","v":""},{"$f":"+IF($A97=\"\",\"\",VLOOKUP($A97,Table!$A$20:$L$185,E$2,0))","v":""},{"$f":"+IF($A97=\"\",\"\",VLOOKUP($A97,Table!$A$20:$L$185,F$2,0)&\"\")","v":""},{"$f":"+IF($A97=\"\",\"\",VLOOKUP($A97,Table!$A$20:$L$185,G$2,0))","v":""},{"$f":"+IF($A97=\"\",\"\",VLOOKUP($A97,Table!$A$20:$L$185,H$2,0)&\"\")","v":""},null,{"$f":"+IF($A97=\"\",\"\",VLOOKUP($A97,Table!$A$20:$L$185,J$2,0))","v":""},{"$f":"+IF($A97=\"\",\"\",VLOOKUP($A97,Table!$A$20:$L$185,K$2,0))","v":""},{"$f":"+IF($A97=\"\",\"\",VLOOKUP($A97,Table!$A$20:$L$185,L$2,0))","v":""},null,{"$f":"+IF($A97=\"\",\"\",VLOOKUP($A97,Table!$A$20:$L$185,N$2,0))","v":""},null,""]

{"sheet":"CCR_1","index":1,"n_rows":75,"n_cols":81,"rows_kept":75,"cut":false,"hidden":false,"merged":[[73,1,73,6],[74,1,74,6],[68,1,68,6],[69,1,69,6],[70,1,70,6],[71,1,71,6],[72,1,72,6],[63,1,63,6],[64,1,64,6],[65,1,65,6],[66,1,66,6],[67,1,67,6],[58,1,58,6],[59,1,59,6],[60,1,60,6],[61,1,61,6],[62,1,62,6],[53,1,53,6],[54,1,54,6],[55,1,55,6],[56,1,56,6],[57,1,57,6],[48,1,48,6],[49,1,49,6],[50,1,50,6],[51,1,51,6],[52,1,52,6],[43,1,43,6],[44,1,44,6],[45,1,45,6],[46,1,46,6],[47,1,47,6],[38,1,38,6],[39,1,39,6],[40,1,40,6],[41,1,41,6],[42,1,42,6],[35,1,35,6],[30,1,30,6],[33,1,33,6],[36,1,36,6],[37,1,37,6],[29,1,29,6],[31,1,31,6],[32,1,32,6],[34,1,34,6],[14,0,14,7],[28,0,28,7],[19,1,19,6],[20,1,20,6],[21,1,21,6],[22,2,22,6],[23,1,23,6],[24,1,24,6],[25,1,25,6],[26,1,26,6],[27,1,27,6],[11,0,11,7],[15,1,15,6],[16,2,16,6],[17,1,17,6],[18,1,18,6],[12,0,13,0],[12,7,13,7],[12,1,12,6],[13,1,13,6],[3,2,3,3],[9,0,9,1],[4,9,4,11],[5,9,5,11],[4,2,4,7],[3,4,3,5],[3,6,3,7],[3,0,3,1],[4,0,4,1],[7,0,7,1],[7,2,7,5],[8,0,8,1],[6,6,6,7],[6,0,6,5],[5,0,5,7]]}
[{"$f":"COLUMN()","v":1},{"$f":"COLUMN()","v":2},{"$f":"COLUMN()","v":3},{"$f":"COLUMN()","v":4},{"$f":"COLUMN()","v":5},{"$f":"COLUMN()","v":6},{"$f":"COLUMN()","v":7},{"$f":"COLUMN()","v":8},null,{"$f":"COLUMN()","v":10},{"$f":"COLUMN()","v":11},{"$f":"COLUMN()","v":12},{"$f":"COLUMN()","v":13},{"$f":"COLUMN()","v":14},{"$f":"COLUMN()","v":15},{"$f":"COLUMN()","v":16},{"$f":"COLUMN()","v":17},{"$f":"COLUMN()","v":18},{"$f":"COLUMN()","v":19},{"$f":"COLUMN()","v":20},{"$f":"COLUMN()","v":21},{"$f":"COLUMN()","v":22},{"$f":"COLUMN()","v":23},{"$f":"COLUMN()","v":24},{"$f":"COLUMN()","v":25},{"$f":"COLUMN()","v":26},{"$f":"COLUMN()","v":27},{"$f":"COLUMN()","v":28},{"$f":"COLUMN()","v":29},{"$f":"COLUMN()","v":30},{"$f":"COLUMN()","v":31},{"$f":"COLUMN()","v":32},{"$f":"COLUMN()","v":33},{"$f":"COLUMN()","v":34},{"$f":"COLUMN()","v":35},{"$f":"COLUMN()","v":36},{"$f":"COLUMN()","v":37},{"$f":"COLUMN()","v":38},{"$f":"COLUMN()","v":39},{"$f":"COLUMN()","v":40},{"$f":"COLUMN()","v":41},{"$f":"COLUMN()","v":42},{"$f":"COLUMN()","v":43},{"$f":"COLUMN()","v":44},{"$f":"COLUMN()","v":45},{"$f":"COLUMN()","v":46},{"$f":"COLUMN()","v":47},{"$f":"COLUMN()","v":48},{"$f":"COLUMN()","v":49},{"$f":"COLUMN()","v":50},{"$f":"COLUMN()","v":51},{"$f":"COLUMN()","v":52},{"$f":"COLUMN()","v":53},{"$f":"COLUMN()","v":54},{"$f":"COLUMN()","v":55},{"$f":"COLUMN()","v":56},{"$f":"COLUMN()","v":57},{"$f":"COLUMN()","v":58},{"$f":"COLUMN()","v":59},{"$f":"COLUMN()","v":60},{"$f":"COLUMN()","v":61},{"$f":"COLUMN()","v":62},{"$f":"COLUMN()","v":63},{"$f":"COLUMN()","v":64},{"$f":"COLUMN()","v":65},{"$f":"COLUMN()","v":66},{"$f":"COLUMN()","v":67},{"$f":"COLUMN()","v":68},{"$f":"COLUMN()","v":69},{"$f":"COLUMN()","v":70},{"$f":"COLUMN()","v":71},{"$f":"COLUMN()","v":72},{"$f":"COLUMN()","v":73},{"$f":"COLUMN()","v":74},{"$f":"COLUMN()","v":75},{"$f":"COLUMN()","v":76},{"$f":"COLUMN()","v":77},{"$f":"COLUMN()","v":78},{"$f":"COLUMN()","v":79},{"$f":"COLUMN()","v":80},{"$f":"COLUMN()","v":81}]
[]
[null,null,null,null,null,null,null,null,null,{"$f":"IFERROR(VLOOKUP((J$1-9)&\".YC\",CCR_0!$P:$Q,2,0),\"\")","v":""},{"$f":"IFERROR(VLOOKUP((K$1-9)&\".YC\",CCR_0!$P:$Q,2,0),\"\")","v":""},{"$f":"IFERROR(VLOOKUP((L$1-9)&\".YC\",CCR_0!$P:$Q,2,0),\"\")","v":""},{"$f":"IFERROR(VLOOKUP((M$1-9)&\".YC\",CCR_0!$P:$Q,2,0),\"\")","v":""},{"$f":"IFERROR(VLOOKUP((N$1-9)&\".YC\",CCR_0!$P:$Q,2,0),\"\")","v":""},{"$f":"IFERROR(VLOOKUP((O$1-9)&\".YC\",CCR_0!$P:$Q,2,0),\"\")","v":""},{"$f":"IFERROR(VLOOKUP((P$1-9)&\".YC\",CCR_0!$P:$Q,2,0),\"\")","v":""},{"$f":"IFERROR(VLOOKUP((Q$1-9)&\".YC\",CCR_0!$P:$Q,2,0),\"\")","v":""},{"$f":"IFERROR(VLOOKUP((R$1-9)&\".YC\",CCR_0!$P:$Q,2,0),\"\")","v":""},{"$f":"IFERROR(VLOOKUP((S$1-9)&\".YC\",CCR_0!$P:$Q,2,0),\"\")","v":""},{"$f":"IFERROR(VLOOKUP((T$1-9)&\".YC\",CCR_0!$P:$Q,2,0),\"\")","v":""},{"$f":"IFERROR(VLOOKUP((U$1-9)&\".YC\",CCR_0!$P:$Q,2,0),\"\")","v":""},{"$f":"IFERROR(VLOOKUP((V$1-9)&\".YC\",CCR_0!$P:$Q,2,0),\"\")","v":""},{"$f":"IFERROR(VLOOKUP((W$1-9)&\".YC\",CCR_0!$P:$Q,2,0),\"\")","v":""},{"$f":"IFERROR(VLOOKUP((X$1-9)&\".YC\",CCR_0!$P:$Q,2,0),\"\")","v":""},{"$f":"IFERROR(VLOOKUP((Y$1-9)&\".YC\",CCR_0!$P:$Q,2,0),\"\")","v":""},{"$f":"IFERROR(VLOOKUP((Z$1-9)&\".YC\",CCR_0!$P:$Q,2,0),\"\")","v":""},{"$f":"IFERROR(VLOOKUP((AA$1-9)&\".YC\",CCR_0!$P:$Q,2,0),\"\")","v":""},{"$f":"IFERROR(VLOOKUP((AB$1-9)&\".YC\",CCR_0!$P:$Q,2,0),\"\")","v":""},{"$f":"IFERROR(VLOOKUP((AC$1-9)&\".YC\",CCR_0!$P:$Q,2,0),\"\")","v":""},{"$f":"IFERROR(VLOOKUP((AD$1-9)&\".YC\",CCR_0!$P:$Q,2,0),\"\")","v":""},{"$f":"IFERROR(VLOOKUP((AE$1-9)&\".YC\",CCR_0!$P:$Q,2,0),\"\")","v":""},{"$f":"IFERROR(VLOOKUP((AF$1-9)&\".YC\",CCR_0!$P:$Q,2,0),\"\")","v":""},{"$f":"IFERROR(VLOOKUP((AG$1-9)&\".YC\",CCR_0!$P:$Q,2,0),\"\")","v":""},{"$f":"IFERROR(VLOOKUP((AH$1-9)&\".YC\",CCR_0!$P:$Q,2,0),\"\")","v":""},{"$f":"IFERROR(VLOOKUP((AI$1-9)&\".YC\",CCR_0!$P:$Q,2,0),\"\")","v":""},{"$f":"IFERROR(VLOOKUP((AJ$1-9)&\".YC\",CCR_0!$P:$Q,2,0),\"\")","v":""},{"$f":"IFERROR(VLOOKUP((AK$1-9)&\".YC\",CCR_0!$P:$Q,2,0),\"\")","v":""},{"$f":"IFERROR(VLOOKUP((AL$1-9)&\".YC\",CCR_0!$P:$Q,2,0),\"\")","v":""},{"$f":"IFERROR(VLOOKUP((AM$1-9)&\".YC\",CCR_0!$P:$Q,2,0),\"\")","v":""},{"$f":"IFERROR(VLOOKUP((AN$1-9)&\".YC\",CCR_0!$P:$Q,2,0),\"\")","v":""},{"$f":"IFERROR(VLOOKUP((AO$1-9)&\".YC\",CCR_0!$P:$Q,2,0),\"\")","v":""},{"$f":"IFERROR(VLOOKUP((AP$1-9)&\".YC\",CCR_0!$P:$Q,2,0),\"\")","v":""},{"$f":"IFERROR(VLOOKUP((AQ$1-9)&\".YC\",CCR_0!$P:$Q,2,0),\"\")","v":""},{"$f":"IFERROR(VLOOKUP((AR$1-9)&\".YC\",CCR_0!$P:$Q,2,0),\"\")","v":""},{"$f":"IFERROR(VLOOKUP((AS$1-9)&\".YC\",CCR_0!$P:$Q,2,0),\"\")","v":""},{"$f":"IFERROR(VLOOKUP((AT$1-9)&\".YC\",CCR_0!$P:$Q,2,0),\"\")","v":""},{"$f":"IFERROR(VLOOKUP((AU$1-9)&\".YC\",CCR_0!$P:$Q,2,0),\"\")","v":""},{"$f":"IFERROR(VLOOKUP((AV$1-9)&\".YC\",CCR_0!$P:$Q,2,0),\"\")","v":""},{"$f":"IFERROR(VLOOKUP((AW$1-9)&\".YC\",CCR_0!$P:$Q,2,0),\"\")","v":""},{"$f":"IFERROR(VLOOKUP((AX$1-9)&\".YC\",CCR_0!$P:$Q,2,0),\"\")","v":""},{"$f":"IFERROR(VLOOKUP((AY$1-9)&\".YC\",CCR_0!$P:$Q,2,0),\"\")","v":""},{"$f":"IFERROR(VLOOKUP((AZ$1-9)&\".YC\",CCR_0!$P:$Q,2,0),\"\")","v":""},{"$f":"IFERROR(VLOOKUP((BA$1-9)&\".YC\",CCR_0!$P:$Q,2,0),\"\")","v":""},{"$f":"IFERROR(VLOOKUP((BB$1-9)&\".YC\",CCR_0!$P:$Q,2,0),\"\")","v":""},{"$f":"IFERROR(VLOOKUP((BC$1-9)&\".YC\",CCR_0!$P:$Q,2,0),\"\")","v":""},{"$f":"IFERROR(VLOOKUP((BD$1-9)&\".YC\",CCR_0!$P:$Q,2,0),\"\")","v":""},{"$f":"IFERROR(VLOOKUP((BE$1-9)&\".YC\",CCR_0!$P:$Q,2,0),\"\")","v":""},{"$f":"IFERROR(VLOOKUP((BF$1-9)&\".YC\",CCR_0!$P:$Q,2,0),\"\")","v":""},{"$f":"IFERROR(VLOOKUP((BG$1-9)&\".YC\",CCR_0!$P:$Q,2,0),\"\")","v":""},{"$f":"IFERROR(VLOOKUP((BH$1-9)&\".YC\",CCR_0!$P:$Q,2,0),\"\")","v":""},{"$f":"IFERROR(VLOOKUP((BI$1-9)&\".YC\",CCR_0!$P:$Q,2,0),\"\")","v":""},{"$f":"IFERROR(VLOOKUP((BJ$1-9)&\".YC\",CCR_0!$P:$Q,2,0),\"\")","v":""},{"$f":"IFERROR(VLOOKUP((BK$1-9)&\".YC\",CCR_0!$P:$Q,2,0),\"\")","v":""},{"$f":"IFERROR(VLOOKUP((BL$1-9)&\".YC\",CCR_0!$P:$Q,2,0),\"\")","v":""},{"$f":"IFERROR(VLOOKUP((BM$1-9)&\".YC\",CCR_0!$P:$Q,2,0),\"\")","v":""},{"$f":"IFERROR(VLOOKUP((BN$1-9)&\".YC\",CCR_0!$P:$Q,2,0),\"\")","v":""},{"$f":"IFERROR(VLOOKUP((BO$1-9)&\".YC\",CCR_0!$P:$Q,2,0),\"\")","v":""},{"$f":"IFERROR(VLOOKUP((BP$1-9)&\".YC\",CCR_0!$P:$Q,2,0),\"\")","v":""},{"$f":"IFERROR(VLOOKUP((BQ$1-9)&\".YC\",CCR_0!$P:$Q,2,0),\"\")","v":""},{"$f":"IFERROR(VLOOKUP((BR$1-9)&\".YC\",CCR_0!$P:$Q,2,0),\"\")","v":""},{"$f":"IFERROR(VLOOKUP((BS$1-9)&\".YC\",CCR_0!$P:$Q,2,0),\"\")","v":""},{"$f":"IFERROR(VLOOKUP((BT$1-9)&\".YC\",CCR_0!$P:$Q,2,0),\"\")","v":""},{"$f":"IFERROR(VLOOKUP((BU$1-9)&\".YC\",CCR_0!$P:$Q,2,0),\"\")","v":""},{"$f":"IFERROR(VLOOKUP((BV$1-9)&\".YC\",CCR_0!$P:$Q,2,0),\"\")","v":""},{"$f":"IFERROR(VLOOKUP((BW$1-9)&\".YC\",CCR_0!$P:$Q,2,0),\"\")","v":""},{"$f":"IFERROR(VLOOKUP((BX$1-9)&\".YC\",CCR_0!$P:$Q,2,0),\"\")","v":""},{"$f":"IFERROR(VLOOKUP((BY$1-9)&\".YC\",CCR_0!$P:$Q,2,0),\"\")","v":""},{"$f":"IFERROR(VLOOKUP((BZ$1-9)&\".YC\",CCR_0!$P:$Q,2,0),\"\")","v":""},{"$f":"IFERROR(VLOOKUP((CA$1-9)&\".YC\",CCR_0!$P:$Q,2,0),\"\")","v":""},{"$f":"IFERROR(VLOOKUP((CB$1-9)&\".YC\",CCR_0!$P:$Q,2,0),\"\")","v":""},{"$f":"IFERROR(VLOOKUP((CC$1-9)&\".YC\",CCR_0!$P:$Q,2,0),\"\")","v":""}]
["TBI Provider ID",null,{"$f":"+IF(CCR_0!$C$4=\"\",\"\",CCR_0!$C$4)","v":""},null,"NHTD Provider ID ",null,{"$f":"+IF(CCR_0!$G$4=\"\",\"\",CCR_0!$G$4)","v":""}]
["Agency Name",null,{"$f":"+IF(CCR_0!$C$5=\"\",\"\",IF(LEFT(CCR_0!$C$5,5) = \"C1010\", CCR_0!$C$6,CCR_0!$C$5))","v":""},null,null,null,null,null,null,"NEW YORK STATE"]
["New Agency",null,null,null,null,null,null,null,null,"CERTIFIED COST REPORT"]
["Funding State Agency",null,null,null,null,null,"Reporting Period"]
[null,null,"DOH",null,null,null,"Start Date","End Date",null,"SCHEDULE CCR-1"]
[null,null,"TBI","NHTD",null,null,"mm/dd/yyyy","mm/dd/yyyy",null,"PROGRAM/SITE"]
[null,null,{"$f":"IF(CCR_0!C$10=\"\",\"\",CCR_0!C$10)","v":""},{"$f":"IF(CCR_0!D$10=\"\",\"\",CCR_0!D$10)","v":""},null,null,{"$f":"IF(CCR_0!G$10=\"\",\"\",CCR_0!G$10)","v":""},{"$f":"IF(CCR_0!H$10=\"\",\"\",CCR_0!H$10)","v":""},null,"DATA",null,"Rev. Feb. 2021"]
[]
["Program Name & Code",null,null,null,null,null,null,null,null,{"$f":"IF(J17=\"\",\"\",J$16 & \"[\"&J$17&\"]\")","v":""},{"$f":"IF(K17=\"\",\"\",K$16 & \"[\"&K$17&\"]\")","v":""},{"$f":"IF(L17=\"\",\"\",L$16 & \"[\"&L$17&\"]\")","v":""},{"$f":"IF(M17=\"\",\"\",M$16 & \"[\"&M$17&\"]\")","v":""},{"$f":"IF(N17=\"\",\"\",N$16 & \"[\"&N$17&\"]\")","v":""},"","","","","","","","","","","","","","","","","","","","","","","","","","","","","",{"$f":"IF(AR17=\"\",\"\",AR$16 & \"[\"&AR$17&\"]\")","v":""},"","","","","","","","","","","","","","","","",{"$f":"IF(BI17=\"\",\"\",BI$16 & \"[\"&BI$17&\"]\")","v":""},"","","","","","",{"$f":"IF(BP17=\"\",\"\",BP$16 & \"[\"&BP$17&\"]\")","v":""},{"$f":"IF(BQ17=\"\",\"\",BQ$16 & \"[\"&BQ$17&\"]\")","v":""},{"$f":"IF(BR17=\"\",\"\",BR$16 & \"[\"&BR$17&\"]\")","v":""},{"$f":"IF(BS17=\"\",\"\",BS$16 & \"[\"&BS$17&\"]\")","v":""},{"$f":"IF(BT17=\"\",\"\",BT$16 & \"[\"&BT$17&\"]\")","v":""},"","","","","","","",{"$f":"IF(CB17=\"\",\"\",CB$16 & \"[\"&CB$17&\"]\")","v":""},""]
["Line No.","Column Number",null,null,null,null,null,"Cost Codes",0,{"$f":"IF($J3=\"\",\"\",I$13+1)","v":""},{"$f":"IF($J3=\"\",\"\",J$13+1)","v":""},{"$f":"IF($J3=\"\",\"\",K$13+1)","v":""},{"$f":"IF($J3=\"\",\"\",L$13+1)","v":""},{"$f":"IF($J3=\"\",\"\",M$13+1)","v":""},"","","","","","","","","","","","","","","","","","","","","","","","","","","","","",{"$f":"IF($J3=\"\",\"\",AQ$13+1)","v":""},"","","","","","","","","","","","","","","","",{"$f":"IF($J3=\"\",\"\",BH$13+1)","v":""},"","","","","","","","","","",{"$f":"IF($J3=\"\",\"\",BS$13+1)","v":""},{"$f":"IF($J3=\"\",\"\",BT$13+1)","v":""},{"$f":"IF($J3=\"\",\"\",BU$13+1)","v":""},{"$f":"IF($J3=\"\",\"\",BV$13+1)","v":""},{"$f":"IF($J3=\"\",\"\",BW$13+1)","v":""},{"$f":"IF($J3=\"\",\"\",BX$13+1)","v":""},{"$f":"IF($J3=\"\",\"\",BY$13+1)","v":""},{"$f":"IF($J3=\"\",\"\",BZ$13+1)","v":""},{"$f":"IF($J3=\"\",\"\",CA$13+1)","v":""},{"$f":"IF($J3=\"\",\"\",CB$13+1)","v":""}]
[null,"Item Description",null,null,null,null,null,null,{"$f":"+Table!$B$1","v":2},{"$f":"IF(J$3=\"\",\"\",VLOOKUP(J$3,Table!$A:$M,$I14,0))","v":""},{"$f":"IF(K$3=\"\",\"\",VLOOKUP(K$3,Table!$A:$M,$I14,0))","v":""},{"$f":"IF(L$3=\"\",\"\",VLOOKUP(L$3,Table!$A:$M,$I14,0))","v":""},{"$f":"IF(M$3=\"\",\"\",VLOOKUP(M$3,Table!$A:$M,$I14,0))","v":""},{"$f":"IF(N$3=\"\",\"\",VLOOKUP(N$3,Table!$A:$M,$I14,0))","v":""},{"$f":"IF(O$3=\"\",\"\",VLOOKUP(O$3,Table!$A:$M,$I14,0))","v":""},{"$f":"IF(P$3=\"\",\"\",VLOOKUP(P$3,Table!$A:$M,$I14,0))","v":""},{"$f":"IF(Q$3=\"\",\"\",VLOOKUP(Q$3,Table!$A:$M,$I14,0))","v":""},{"$f":"IF(R$3=\"\",\"\",VLOOKUP(R$3,Table!$A:$M,$I14,0))","v":""},{"$f":"IF(S$3=\"\",\"\",VLOOKUP(S$3,Table!$A:$M,$I14,0))","v":""},{"$f":"IF(T$3=\"\",\"\",VLOOKUP(T$3,Table!$A:$M,$I14,0))","v":""},{"$f":"IF(U$3=\"\",\"\",VLOOKUP(U$3,Table!$A:$M,$I14,0))","v":""},{"$f":"IF(V$3=\"\",\"\",VLOOKUP(V$3,Table!$A:$M,$I14,0))","v":""},{"$f":"IF(W$3=\"\",\"\",VLOOKUP(W$3,Table!$A:$M,$I14,0))","v":""},{"$f":"IF(X$3=\"\",\"\",VLOOKUP(X$3,Table!$A:$M,$I14,0))","v":""},{"$f":"IF(Y$3=\"\",\"\",VLOOKUP(Y$3,Table!$A:$M,$I14,0))","v":""},{"$f":"IF(Z$3=\"\",\"\",VLOOKUP(Z$3,Table!$A:$M,$I14,0))","v":""},{"$f":"IF(AA$3=\"\",\"\",VLOOKUP(AA$3,Table!$A:$M,$I14,0))","v":""},{"$f":"IF(AB$3=\"\",\"\",VLOOKUP(AB$3,Table!$A:$M,$I14,0))","v":""},{"$f":"IF(AC$3=\"\",\"\",VLOOKUP(AC$3,Table!$A:$M,$I14,0))","v":""},{"$f":"IF(AD$3=\"\",\"\",VLOOKUP(AD$3,Table!$A:$M,$I14,0))","v":""},{"$f":"IF(AE$3=\"\",\"\",VLOOKUP(AE$3,Table!$A:$M,$I14,0))","v":""},{"$f":"IF(AF$3=\"\",\"\",VLOOKUP(AF$3,Table!$A:$M,$I14,0))","v":""},{"$f":"IF(AG$3=\"\",\"\",VLOOKUP(AG$3,Table!$A:$M,$I14,0))","v":""},{"$f":"IF(AH$3=\"\",\"\",VLOOKUP(AH$3,Table!$A:$M,$I14,0))","v":""},{"$f":"IF(AI$3=\"\",\"\",VLOOKUP(AI$3,Table!$A:$M,$I14,0))","v":""},{"$f":"IF(AJ$3=\"\",\"\",VLOOKUP(AJ$3,Table!$A:$M,$I14,0))","v":""},{"$f":"IF(AK$3=\"\",\"\",VLOOKUP(AK$3,Table!$A:$M,$I14,0))","v":""},{"$f":"IF(AL$3=\"\",\"\",VLOOKUP(AL$3,Table!$A:$M,$I14,0))","v":""},{"$f":"IF(AM$3=\"\",\"\",VLOOKUP(AM$3,Table!$A:$M,$I14,0))","v":""},{"$f":"IF(AN$3=\"\",\"\",VLOOKUP(AN$3,Table!$A:$M,$I14,0))","v":""},{"$f":"IF(AO$3=\"\",\"\",VLOOKUP(AO$3,Table!$A:$M,$I14,0))","v":""},{"$f":"IF(AP$3=\"\",\"\",VLOOKUP(AP$3,Table!$A:$M,$I14,0))","v":""},{"$f":"IF(AQ$3=\"\",\"\",VLOOKUP(AQ$3,Table!$A:$M,$I14,0))","v":""},{"$f":"IF(AR$3=\"\",\"\",VLOOKUP(AR$3,Table!$A:$M,$I14,0))","v":""},{"$f":"IF(AS$3=\"\",\"\",VLOOKUP(AS$3,Table!$A:$M,$I14,0))","v":""},{"$f":"IF(AT$3=\"\",\"\",VLOOKUP(AT$3,Table!$A:$M,$I14,0))","v":""},{"$f":"IF(AU$3=\"\",\"\",VLOOKUP(AU$3,Table!$A:$M,$I14,0))","v":""},{"$f":"IF(AV$3=\"\",\"\",VLOOKUP(AV$3,Table!$A:$M,$I14,0))","v":""},{"$f":"IF(AW$3=\"\",\"\",VLOOKUP(AW$3,Table!$A:$M,$I14,0))","v":""},{"$f":"IF(AX$3=\"\",\"\",VLOOKUP(AX$3,Table!$A:$M,$I14,0))","v":""},{"$f":"IF(AY$3=\"\",\"\",VLOOKUP(AY$3,Table!$A:$M,$I14,0))","v":""},{"$f":"IF(AZ$3=\"\",\"\",VLOOKUP(AZ$3,Table!$A:$M,$I14,0))","v":""},{"$f":"IF(BA$3=\"\",\"\",VLOOKUP(BA$3,Table!$A:$M,$I14,0))","v":""},{"$f":"IF(BB$3=\"\",\"\",VLOOKUP(BB$3,Table!$A:$M,$I14,0))","v":""},{"$f":"IF(BC$3=\"\",\"\",VLOOKUP(BC$3,Table!$A:$M,$I14,0))","v":""},{"$f":"IF(BD$3=\"\",\"\",VLOOKUP(BD$3,Table!$A:$M,$I14,0))","v":""},{"$f":"IF(BE$3=\"\",\"\",VLOOKUP(BE$3,Table!$A:$M,$I14,0))","v":""},{"$f":"IF(BF$3=\"\",\"\",VLOOKUP(BF$3,Table!$A:$M,$I14,0))","v":""},{"$f":"IF(BG$3=\"\",\"\",VLOOKUP(BG$3,Table!$A:$M,$I14,0))","v":""},{"$f":"IF(BH$3=\"\",\"\",VLOOKUP(BH$3,Table!$A:$M,$I14,0))","v":""},{"$f":"IF(BI$3=\"\",\"\",VLOOKUP(BI$3,Table!$A:$M,$I14,0))","v":""},{"$f":"IF(BJ$3=\"\",\"\",VLOOKUP(BJ$3,Table!$A:$M,$I14,0))","v":""},{"$f":"IF(BK$3=\"\",\"\",VLOOKUP(BK$3,Table!$A:$M,$I14,0))","v":""},{"$f":"IF(BL$3=\"\",\"\",VLOOKUP(BL$3,Table!$A:$M,$I14,0))","v":""},{"$f":"IF(BM$3=\"\",\"\",VLOOKUP(BM$3,Table!$A:$M,$I14,0))","v":""},{"$f":"IF(BN$3=\"\",\"\",VLOOKUP(BN$3,Table!$A:$M,$I14,0))","v":""},{"$f":"IF(BO$3=\"\",\"\",VLOOKUP(BO$3,Table!$A:$M,$I14,0))","v":""},{"$f":"IF(BP$3=\"\",\"\",VLOOKUP(BP$3,Table!$A:$M,$I14,0))","v":""},{"$f":"IF(BQ$3=\"\",\"\",VLOOKUP(BQ$3,Table!$A:$M,$I14,0))","v":""},{"$f":"IF(BR$3=\"\",\"\",VLOOKUP(BR$3,Table!$A:$M,$I14,0))","v":""},{"$f":"IF(BS$3=\"\",\"\",VLOOKUP(BS$3,Table!$A:$M,$I14,0))","v":""},{"$f":"IF(BT$3=\"\",\"\",VLOOKUP(BT$3,Table!$A:$M,$I14,0))","v":""},{"$f":"IF(BU$3=\"\",\"\",VLOOKUP(BU$3,Table!$A:$M,$I14,0))","v":""},{"$f":"IF(BV$3=\"\",\"\",VLOOKUP(BV$3,Table!$A:$M,$I14,0))","v":""},{"$f":"IF(BW$3=\"\",\"\",VLOOKUP(BW$3,Table!$A:$M,$I14,0))","v":""},{"$f":"IF(BX$3=\"\",\"\",VLOOKUP(BX$3,Table!$A:$M,$I14,0))","v":""},{"$f":"IF(BY$3=\"\",\"\",VLOOKUP(BY$3,Table!$A:$M,$I14,0))","v":""},{"$f":"IF(BZ$3=\"\",\"\",VLOOKUP(BZ$3,Table!$A:$M,$I14,0))","v":""},{"$f":"IF(CA$3=\"\",\"\",VLOOKUP(CA$3,Table!$A:$M,$I14,0))","v":""},{"$f":"IF(CB$3=\"\",\"\",VLOOKUP(CB$3,Table!$A:$M,$I14,0))","v":""},{"$f":"IF(CC$3=\"\",\"\",VLOOKUP(CC$3,Table!$A:$M,$I14,0))","v":""}]
["Section A: General Information"]
[1,"Program Type",null,null,null,null,null,"00070",{"$f":"+Table!$D$1","v":4},{"$f":"IF(J$3=\"\",\"\",VLOOKUP(J$3,Table!$A:$M,$I16,0))","v":""},{"$f":"IF(K$3=\"\",\"\",VLOOKUP(K$3,Table!$A:$M,$I16,0))","v":""},{"$f":"IF(L$3=\"\",\"\",VLOOKUP(L$3,Table!$A:$M,$I16,0))","v":""},{"$f":"IF(M$3=\"\",\"\",VLOOKUP(M$3,Table!$A:$M,$I16,0))","v":""},{"$f":"IF(N$3=\"\",\"\",VLOOKUP(N$3,Table!$A:$M,$I16,0))","v":""},{"$f":"IF(O$3=\"\",\"\",VLOOKUP(O$3,Table!$A:$M,$I16,0))","v":""},{"$f":"IF(P$3=\"\",\"\",VLOOKUP(P$3,Table!$A:$M,$I16,0))","v":""},{"$f":"IF(Q$3=\"\",\"\",VLOOKUP(Q$3,Table!$A:$M,$I16,0))","v":""},{"$f":"IF(R$3=\"\",\"\",VLOOKUP(R$3,Table!$A:$M,$I16,0))","v":""},{"$f":"IF(S$3=\"\",\"\",VLOOKUP(S$3,Table!$A:$M,$I16,0))","v":""},{"$f":"IF(T$3=\"\",\"\",VLOOKUP(T$3,Table!$A:$M,$I16,0))","v":""},{"$f":"IF(U$3=\"\",\"\",VLOOKUP(U$3,Table!$A:$M,$I16,0))","v":""},{"$f":"IF(V$3=\"\",\"\",VLOOKUP(V$3,Table!$A:$M,$I16,0))","v":""},{"$f":"IF(W$3=\"\",\"\",VLOOKUP(W$3,Table!$A:$M,$I16,0))","v":""},{"$f":"IF(X$3=\"\",\"\",VLOOKUP(X$3,Table!$A:$M,$I16,0))","v":""},{"$f":"IF(Y$3=\"\",\"\",VLOOKUP(Y$3,Table!$A:$M,$I16,0))","v":""},{"$f":"IF(Z$3=\"\",\"\",VLOOKUP(Z$3,Table!$A:$M,$I16,0))","v":""},{"$f":"IF(AA$3=\"\",\"\",VLOOKUP(AA$3,Table!$A:$M,$I16,0))","v":""},{"$f":"IF(AB$3=\"\",\"\",VLOOKUP(AB$3,Table!$A:$M,$I16,0))","v":""},{"$f":"IF(AC$3=\"\",\"\",VLOOKUP(AC$3,Table!$A:$M,$I16,0))","v":""},{"$f":"IF(AD$3=\"\",\"\",VLOOKUP(AD$3,Table!$A:$M,$I16,0))","v":""},{"$f":"IF(AE$3=\"\",\"\",VLOOKUP(AE$3,Table!$A:$M,$I16,0))","v":""},{"$f":"IF(AF$3=\"\",\"\",VLOOKUP(AF$3,Table!$A:$M,$I16,0))","v":""},{"$f":"IF(AG$3=\"\",\"\",VLOOKUP(AG$3,Table!$A:$M,$I16,0))","v":""},{"$f":"IF(AH$3=\"\",\"\",VLOOKUP(AH$3,Table!$A:$M,$I16,0))","v":""},{"$f":"IF(AI$3=\"\",\"\",VLOOKUP(AI$3,Table!$A:$M,$I16,0))","v":""},{"$f":"IF(AJ$3=\"\",\"\",VLOOKUP(AJ$3,Table!$A:$M,$I16,0))","v":""},{"$f":"IF(AK$3=\"\",\"\",VLOOKUP(AK$3,Table!$A:$M,$I16,0))","v":""},{"$f":"IF(AL$3=\"\",\"\",VLOOKUP(AL$3,Table!$A:$M,$I16,0))","v":""},{"$f":"IF(AM$3=\"\",\"\",VLOOKUP(AM$3,Table!$A:$M,$I16,0))","v":""},{"$f":"IF(AN$3=\"\",\"\",VLOOKUP(AN$3,Table!$A:$M,$I16,0))","v":""},{"$f":"IF(AO$3=\"\",\"\",VLOOKUP(AO$3,Table!$A:$M,$I16,0))","v":""},{"$f":"IF(AP$3=\"\",\"\",VLOOKUP(AP$3,Table!$A:$M,$I16,0))","v":""},{"$f":"IF(AQ$3=\"\",\"\",VLOOKUP(AQ$3,Table!$A:$M,$I16,0))","v":""},{"$f":"IF(AR$3=\"\",\"\",VLOOKUP(AR$3,Table!$A:$M,$I16,0))","v":""},{"$f":"IF(AS$3=\"\",\"\",VLOOKUP(AS$3,Table!$A:$M,$I16,0))","v":""},{"$f":"IF(AT$3=\"\",\"\",VLOOKUP(AT$3,Table!$A:$M,$I16,0))","v":""},{"$f":"IF(AU$3=\"\",\"\",VLOOKUP(AU$3,Table!$A:$M,$I16,0))","v":""},{"$f":"IF(AV$3=\"\",\"\",VLOOKUP(AV$3,Table!$A:$M,$I16,0))","v":""},{"$f":"IF(AW$3=\"\",\"\",VLOOKUP(AW$3,Table!$A:$M,$I16,0))","v":""},{"$f":"IF(AX$3=\"\",\"\",VLOOKUP(AX$3,Table!$A:$M,$I16,0))","v":""},{"$f":"IF(AY$3=\"\",\"\",VLOOKUP(AY$3,Table!$A:$M,$I16,0))","v":""},{"$f":"IF(AZ$3=\"\",\"\",VLOOKUP(AZ$3,Table!$A:$M,$I16,0))","v":""},{"$f":"IF(BA$3=\"\",\"\",VLOOKUP(BA$3,Table!$A:$M,$I16,0))","v":""},{"$f":"IF(BB$3=\"\",\"\",VLOOKUP(BB$3,Table!$A:$M,$I16,0))","v":""},{"$f":"IF(BC$3=\"\",\"\",VLOOKUP(BC$3,Table!$A:$M,$I16,0))","v":""},{"$f":"IF(BD$3=\"\",\"\",VLOOKUP(BD$3,Table!$A:$M,$I16,0))","v":""},{"$f":"IF(BE$3=\"\",\"\",VLOOKUP(BE$3,Table!$A:$M,$I16,0))","v":""},{"$f":"IF(BF$3=\"\",\"\",VLOOKUP(BF$3,Table!$A:$M,$I16,0))","v":""},{"$f":"IF(BG$3=\"\",\"\",VLOOKUP(BG$3,Table!$A:$M,$I16,0))","v":""},{"$f":"IF(BH$3=\"\",\"\",VLOOKUP(BH$3,Table!$A:$M,$I16,0))","v":""},{"$f":"IF(BI$3=\"\",\"\",VLOOKUP(BI$3,Table!$A:$M,$I16,0))","v":""},{"$f":"IF(BJ$3=\"\",\"\",VLOOKUP(BJ$3,Table!$A:$M,$I16,0))","v":""},{"$f":"IF(BK$3=\"\",\"\",VLOOKUP(BK$3,Table!$A:$M,$I16,0))","v":""},{"$f":"IF(BL$3=\"\",\"\",VLOOKUP(BL$3,Table!$A:$M,$I16,0))","v":""},{"$f":"IF(BM$3=\"\",\"\",VLOOKUP(BM$3,Table!$A:$M,$I16,0))","v":""},{"$f":"IF(BN$3=\"\",\"\",VLOOKUP(BN$3,Table!$A:$M,$I16,0))","v":""},{"$f":"IF(BO$3=\"\",\"\",VLOOKUP(BO$3,Table!$A:$M,$I16,0))","v":""},{"$f":"IF(BP$3=\"\",\"\",VLOOKUP(BP$3,Table!$A:$M,$I16,0))","v":""},{"$f":"IF(BQ$3=\"\",\"\",VLOOKUP(BQ$3,Table!$A:$M,$I16,0))","v":""},{"$f":"IF(BR$3=\"\",\"\",VLOOKUP(BR$3,Table!$A:$M,$I16,0))","v":""},{"$f":"IF(BS$3=\"\",\"\",VLOOKUP(BS$3,Table!$A:$M,$I16,0))","v":""},{"$f":"IF(BT$3=\"\",\"\",VLOOKUP(BT$3,Table!$A:$M,$I16,0))","v":""},{"$f":"IF(BU$3=\"\",\"\",VLOOKUP(BU$3,Table!$A:$M,$I16,0))","v":""},{"$f":"IF(BV$3=\"\",\"\",VLOOKUP(BV$3,Table!$A:$M,$I16,0))","v":""},{"$f":"IF(BW$3=\"\",\"\",VLOOKUP(BW$3,Table!$A:$M,$I16,0))","v":""},{"$f":"IF(BX$3=\"\",\"\",VLOOKUP(BX$3,Table!$A:$M,$I16,0))","v":""},{"$f":"IF(BY$3=\"\",\"\",VLOOKUP(BY$3,Table!$A:$M,$I16,0))","v":""},{"$f":"IF(BZ$3=\"\",\"\",VLOOKUP(BZ$3,Table!$A:$M,$I16,0))","v":""},{"$f":"IF(CA$3=\"\",\"\",VLOOKUP(CA$3,Table!$A:$M,$I16,0))","v":""},{"$f":"IF(CB$3=\"\",\"\",VLOOKUP(CB$3,Table!$A:$M,$I16,0))","v":""},{"$f":"IF(CC$3=\"\",\"\",VLOOKUP(CC$3,Table!$A:$M,$I16,0))","v":""}]
[{"$f":"+A16+1","v":2},"Program Code",null,null,null,null,null,"00010",{"$f":"+Table!$C$1","v":3},{"$f":"IF(J$3=\"\",\"\",VLOOKUP(J$3,Table!$A:$M,$I17,0))","v":""},{"$f":"IF(K$3=\"\",\"\",VLOOKUP(K$3,Table!$A:$M,$I17,0))","v":""},{"$f":"IF(L$3=\"\",\"\",VLOOKUP(L$3,Table!$A:$M,$I17,0))","v":""},{"$f":"IF(M$3=\"\",\"\",VLOOKUP(M$3,Table!$A:$M,$I17,0))","v":""},{"$f":"IF(N$3=\"\",\"\",VLOOKUP(N$3,Table!$A:$M,$I17,0))","v":""},{"$f":"IF(O$3=\"\",\"\",VLOOKUP(O$3,Table!$A:$M,$I17,0))","v":""},{"$f":"IF(P$3=\"\",\"\",VLOOKUP(P$3,Table!$A:$M,$I17,0))","v":""},{"$f":"IF(Q$3=\"\",\"\",VLOOKUP(Q$3,Table!$A:$M,$I17,0))","v":""},{"$f":"IF(R$3=\"\",\"\",VLOOKUP(R$3,Table!$A:$M,$I17,0))","v":""},{"$f":"IF(S$3=\"\",\"\",VLOOKUP(S$3,Table!$A:$M,$I17,0))","v":""},{"$f":"IF(T$3=\"\",\"\",VLOOKUP(T$3,Table!$A:$M,$I17,0))","v":""},{"$f":"IF(U$3=\"\",\"\",VLOOKUP(U$3,Table!$A:$M,$I17,0))","v":""},{"$f":"IF(V$3=\"\",\"\",VLOOKUP(V$3,Table!$A:$M,$I17,0))","v":""},{"$f":"IF(W$3=\"\",\"\",VLOOKUP(W$3,Table!$A:$M,$I17,0))","v":""},{"$f":"IF(X$3=\"\",\"\",VLOOKUP(X$3,Table!$A:$M,$I17,0))","v":""},{"$f":"IF(Y$3=\"\",\"\",VLOOKUP(Y$3,Table!$A:$M,$I17,0))","v":""},{"$f":"IF(Z$3=\"\",\"\",VLOOKUP(Z$3,Table!$A:$M,$I17,0))","v":""},{"$f":"IF(AA$3=\"\",\"\",VLOOKUP(AA$3,Table!$A:$M,$I17,0))","v":""},{"$f":"IF(AB$3=\"\",\"\",VLOOKUP(AB$3,Table!$A:$M,$I17,0))","v":""},{"$f":"IF(AC$3=\"\",\"\",VLOOKUP(AC$3,Table!$A:$M,$I17,0))","v":""},{"$f":"IF(AD$3=\"\",\"\",VLOOKUP(AD$3,Table!$A:$M,$I17,0))","v":""},{"$f":"IF(AE$3=\"\",\"\",VLOOKUP(AE$3,Table!$A:$M,$I17,0))","v":""},{"$f":"IF(AF$3=\"\",\"\",VLOOKUP(AF$3,Table!$A:$M,$I17,0))","v":""},{"$f":"IF(AG$3=\"\",\"\",VLOOKUP(AG$3,Table!$A:$M,$I17,0))","v":""},{"$f":"IF(AH$3=\"\",\"\",VLOOKUP(AH$3,Table!$A:$M,$I17,0))","v":""},{"$f":"IF(AI$3=\"\",\"\",VLOOKUP(AI$3,Table!$A:$M,$I17,0))","v":""},{"$f":"IF(AJ$3=\"\",\"\",VLOOKUP(AJ$3,Table!$A:$M,$I17,0))","v":""},{"$f":"IF(AK$3=\"\",\"\",VLOOKUP(AK$3,Table!$A:$M,$I17,0))","v":""},{"$f":"IF(AL$3=\"\",\"\",VLOOKUP(AL$3,Table!$A:$M,$I17,0))","v":""},{"$f":"IF(AM$3=\"\",\"\",VLOOKUP(AM$3,Table!$A:$M,$I17,0))","v":""},{"$f":"IF(AN$3=\"\",\"\",VLOOKUP(AN$3,Table!$A:$M,$I17,0))","v":""},{"$f":"IF(AO$3=\"\",\"\",VLOOKUP(AO$3,Table!$A:$M,$I17,0))","v":""},{"$f":"IF(AP$3=\"\",\"\",VLOOKUP(AP$3,Table!$A:$M,$I17,0))","v":""},{"$f":"IF(AQ$3=\"\",\"\",VLOOKUP(AQ$3,Table!$A:$M,$I17,0))","v":""},{"$f":"IF(AR$3=\"\",\"\",VLOOKUP(AR$3,Table!$A:$M,$I17,0))","v":""},{"$f":"IF(AS$3=\"\",\"\",VLOOKUP(AS$3,Table!$A:$M,$I17,0))","v":""},{"$f":"IF(AT$3=\"\",\"\",VLOOKUP(AT$3,Table!$A:$M,$I17,0))","v":""},{"$f":"IF(AU$3=\"\",\"\",VLOOKUP(AU$3,Table!$A:$M,$I17,0))","v":""},{"$f":"IF(AV$3=\"\",\"\",VLOOKUP(AV$3,Table!$A:$M,$I17,0))","v":""},{"$f":"IF(AW$3=\"\",\"\",VLOOKUP(AW$3,Table!$A:$M,$I17,0))","v":""},{"$f":"IF(AX$3=\"\",\"\",VLOOKUP(AX$3,Table!$A:$M,$I17,0))","v":""},{"$f":"IF(AY$3=\"\",\"\",VLOOKUP(AY$3,Table!$A:$M,$I17,0))","v":""},{"$f":"IF(AZ$3=\"\",\"\",VLOOKUP(AZ$3,Table!$A:$M,$I17,0))","v":""},{"$f":"IF(BA$3=\"\",\"\",VLOOKUP(BA$3,Table!$A:$M,$I17,0))","v":""},{"$f":"IF(BB$3=\"\",\"\",VLOOKUP(BB$3,Table!$A:$M,$I17,0))","v":""},{"$f":"IF(BC$3=\"\",\"\",VLOOKUP(BC$3,Table!$A:$M,$I17,0))","v":""},{"$f":"IF(BD$3=\"\",\"\",VLOOKUP(BD$3,Table!$A:$M,$I17,0))","v":""},{"$f":"IF(BE$3=\"\",\"\",VLOOKUP(BE$3,Table!$A:$M,$I17,0))","v":""},{"$f":"IF(BF$3=\"\",\"\",VLOOKUP(BF$3,Table!$A:$M,$I17,0))","v":""},{"$f":"IF(BG$3=\"\",\"\",VLOOKUP(BG$3,Table!$A:$M,$I17,0))","v":""},{"$f":"IF(BH$3=\"\",\"\",VLOOKUP(BH$3,Table!$A:$M,$I17,0))","v":""},{"$f":"IF(BI$3=\"\",\"\",VLOOKUP(BI$3,Table!$A:$M,$I17,0))","v":""},{"$f":"IF(BJ$3=\"\",\"\",VLOOKUP(BJ$3,Table!$A:$M,$I17,0))","v":""},{"$f":"IF(BK$3=\"\",\"\",VLOOKUP(BK$3,Table!$A:$M,$I17,0))","v":""},{"$f":"IF(BL$3=\"\",\"\",VLOOKUP(BL$3,Table!$A:$M,$I17,0))","v":""},{"$f":"IF(BM$3=\"\",\"\",VLOOKUP(BM$3,Table!$A:$M,$I17,0))","v":""},{"$f":"IF(BN$3=\"\",\"\",VLOOKUP(BN$3,Table!$A:$M,$I17,0))","v":""},{"$f":"IF(BO$3=\"\",\"\",VLOOKUP(BO$3,Table!$A:$M,$I17,0))","v":""},{"$f":"IF(BP$3=\"\",\"\",VLOOKUP(BP$3,Table!$A:$M,$I17,0))","v":""},{"$f":"IF(BQ$3=\"\",\"\",VLOOKUP(BQ$3,Table!$A:$M,$I17,0))","v":""},{"$f":"IF(BR$3=\"\",\"\",VLOOKUP(BR$3,Table!$A:$M,$I17,0))","v":""},{"$f":"IF(BS$3=\"\",\"\",VLOOKUP(BS$3,Table!$A:$M,$I17,0))","v":""},{"$f":"IF(BT$3=\"\",\"\",VLOOKUP(BT$3,Table!$A:$M,$I17,0))","v":""},{"$f":"IF(BU$3=\"\",\"\",VLOOKUP(BU$3,Table!$A:$M,$I17,0))","v":""},{"$f":"IF(BV$3=\"\",\"\",VLOOKUP(BV$3,Table!$A:$M,$I17,0))","v":""},{"$f":"IF(BW$3=\"\",\"\",VLOOKUP(BW$3,Table!$A:$M,$I17,0))","v":""},{"$f":"IF(BX$3=\"\",\"\",VLOOKUP(BX$3,Table!$A:$M,$I17,0))","v":""},{"$f":"IF(BY$3=\"\",\"\",VLOOKUP(BY$3,Table!$A:$M,$I17,0))","v":""},{"$f":"IF(BZ$3=\"\",\"\",VLOOKUP(BZ$3,Table!$A:$M,$I17,0))","v":""},{"$f":"IF(CA$3=\"\",\"\",VLOOKUP(CA$3,Table!$A:$M,$I17,0))","v":""},{"$f":"IF(CB$3=\"\",\"\",VLOOKUP(CB$3,Table!$A:$M,$I17,0))","v":""},{"$f":"IF(CC$3=\"\",\"\",VLOOKUP(CC$3,Table!$A:$M,$I17,0))","v":""}]
[3,"Rate Code Description",null,null,null,null,null,"00011",{"$f":"+Table!$L$1","v":12},{"$f":"IF(J$3=\"\",\"\",VLOOKUP(J$3,Table!$A:$M,$I18,0))","v":""},{"$f":"IF(K$3=\"\",\"\",VLOOKUP(K$3,Table!$A:$M,$I18,0))","v":""},{"$f":"IF(L$3=\"\",\"\",VLOOKUP(L$3,Table!$A:$M,$I18,0))","v":""},{"$f":"IF(M$3=\"\",\"\",VLOOKUP(M$3,Table!$A:$M,$I18,0))","v":""},{"$f":"IF(N$3=\"\",\"\",VLOOKUP(N$3,Table!$A:$M,$I18,0))","v":""},{"$f":"IF(O$3=\"\",\"\",VLOOKUP(O$3,Table!$A:$M,$I18,0))","v":""},{"$f":"IF(P$3=\"\",\"\",VLOOKUP(P$3,Table!$A:$M,$I18,0))","v":""},{"$f":"IF(Q$3=\"\",\"\",VLOOKUP(Q$3,Table!$A:$M,$I18,0))","v":""},{"$f":"IF(R$3=\"\",\"\",VLOOKUP(R$3,Table!$A:$M,$I18,0))","v":""},{"$f":"IF(S$3=\"\",\"\",VLOOKUP(S$3,Table!$A:$M,$I18,0))","v":""},{"$f":"IF(T$3=\"\",\"\",VLOOKUP(T$3,Table!$A:$M,$I18,0))","v":""},{"$f":"IF(U$3=\"\",\"\",VLOOKUP(U$3,Table!$A:$M,$I18,0))","v":""},{"$f":"IF(V$3=\"\",\"\",VLOOKUP(V$3,Table!$A:$M,$I18,0))","v":""},{"$f":"IF(W$3=\"\",\"\",VLOOKUP(W$3,Table!$A:$M,$I18,0))","v":""},{"$f":"IF(X$3=\"\",\"\",VLOOKUP(X$3,Table!$A:$M,$I18,0))","v":""},{"$f":"IF(Y$3=\"\",\"\",VLOOKUP(Y$3,Table!$A:$M,$I18,0))","v":""},{"$f":"IF(Z$3=\"\",\"\",VLOOKUP(Z$3,Table!$A:$M,$I18,0))","v":""},{"$f":"IF(AA$3=\"\",\"\",VLOOKUP(AA$3,Table!$A:$M,$I18,0))","v":""},{"$f":"IF(AB$3=\"\",\"\",VLOOKUP(AB$3,Table!$A:$M,$I18,0))","v":""},{"$f":"IF(AC$3=\"\",\"\",VLOOKUP(AC$3,Table!$A:$M,$I18,0))","v":""},{"$f":"IF(AD$3=\"\",\"\",VLOOKUP(AD$3,Table!$A:$M,$I18,0))","v":""},{"$f":"IF(AE$3=\"\",\"\",VLOOKUP(AE$3,Table!$A:$M,$I18,0))","v":""},{"$f":"IF(AF$3=\"\",\"\",VLOOKUP(AF$3,Table!$A:$M,$I18,0))","v":""},{"$f":"IF(AG$3=\"\",\"\",VLOOKUP(AG$3,Table!$A:$M,$I18,0))","v":""},{"$f":"IF(AH$3=\"\",\"\",VLOOKUP(AH$3,Table!$A:$M,$I18,0))","v":""},{"$f":"IF(AI$3=\"\",\"\",VLOOKUP(AI$3,Table!$A:$M,$I18,0))","v":""},{"$f":"IF(AJ$3=\"\",\"\",VLOOKUP(AJ$3,Table!$A:$M,$I18,0))","v":""},{"$f":"IF(AK$3=\"\",\"\",VLOOKUP(AK$3,Table!$A:$M,$I18,0))","v":""},{"$f":"IF(AL$3=\"\",\"\",VLOOKUP(AL$3,Table!$A:$M,$I18,0))","v":""},{"$f":"IF(AM$3=\"\",\"\",VLOOKUP(AM$3,Table!$A:$M,$I18,0))","v":""},{"$f":"IF(AN$3=\"\",\"\",VLOOKUP(AN$3,Table!$A:$M,$I18,0))","v":""},{"$f":"IF(AO$3=\"\",\"\",VLOOKUP(AO$3,Table!$A:$M,$I18,0))","v":""},{"$f":"IF(AP$3=\"\",\"\",VLOOKUP(AP$3,Table!$A:$M,$I18,0))","v":""},{"$f":"IF(AQ$3=\"\",\"\",VLOOKUP(AQ$3,Table!$A:$M,$I18,0))","v":""},{"$f":"IF(AR$3=\"\",\"\",VLOOKUP(AR$3,Table!$A:$M,$I18,0))","v":""},{"$f":"IF(AS$3=\"\",\"\",VLOOKUP(AS$3,Table!$A:$M,$I18,0))","v":""},{"$f":"IF(AT$3=\"\",\"\",VLOOKUP(AT$3,Table!$A:$M,$I18,0))","v":""},{"$f":"IF(AU$3=\"\",\"\",VLOOKUP(AU$3,Table!$A:$M,$I18,0))","v":""},{"$f":"IF(AV$3=\"\",\"\",VLOOKUP(AV$3,Table!$A:$M,$I18,0))","v":""},{"$f":"IF(AW$3=\"\",\"\",VLOOKUP(AW$3,Table!$A:$M,$I18,0))","v":""},{"$f":"IF(AX$3=\"\",\"\",VLOOKUP(AX$3,Table!$A:$M,$I18,0))","v":""},{"$f":"IF(AY$3=\"\",\"\",VLOOKUP(AY$3,Table!$A:$M,$I18,0))","v":""},{"$f":"IF(AZ$3=\"\",\"\",VLOOKUP(AZ$3,Table!$A:$M,$I18,0))","v":""},{"$f":"IF(BA$3=\"\",\"\",VLOOKUP(BA$3,Table!$A:$M,$I18,0))","v":""},{"$f":"IF(BB$3=\"\",\"\",VLOOKUP(BB$3,Table!$A:$M,$I18,0))","v":""},{"$f":"IF(BC$3=\"\",\"\",VLOOKUP(BC$3,Table!$A:$M,$I18,0))","v":""},{"$f":"IF(BD$3=\"\",\"\",VLOOKUP(BD$3,Table!$A:$M,$I18,0))","v":""},{"$f":"IF(BE$3=\"\",\"\",VLOOKUP(BE$3,Table!$A:$M,$I18,0))","v":""},{"$f":"IF(BF$3=\"\",\"\",VLOOKUP(BF$3,Table!$A:$M,$I18,0))","v":""},{"$f":"IF(BG$3=\"\",\"\",VLOOKUP(BG$3,Table!$A:$M,$I18,0))","v":""},{"$f":"IF(BH$3=\"\",\"\",VLOOKUP(BH$3,Table!$A:$M,$I18,0))","v":""},{"$f":"IF(BI$3=\"\",\"\",VLOOKUP(BI$3,Table!$A:$M,$I18,0))","v":""},{"$f":"IF(BJ$3=\"\",\"\",VLOOKUP(BJ$3,Table!$A:$M,$I18,0))","v":""},{"$f":"IF(BK$3=\"\",\"\",VLOOKUP(BK$3,Table!$A:$M,$I18,0))","v":""},{"$f":"IF(BL$3=\"\",\"\",VLOOKUP(BL$3,Table!$A:$M,$I18,0))","v":""},{"$f":"IF(BM$3=\"\",\"\",VLOOKUP(BM$3,Table!$A:$M,$I18,0))","v":""},{"$f":"IF(BN$3=\"\",\"\",VLOOKUP(BN$3,Table!$A:$M,$I18,0))","v":""},{"$f":"IF(BO$3=\"\",\"\",VLOOKUP(BO$3,Table!$A:$M,$I18,0))","v":""},{"$f":"IF(BP$3=\"\",\"\",VLOOKUP(BP$3,Table!$A:$M,$I18,0))","v":""},{"$f":"IF(BQ$3=\"\",\"\",VLOOKUP(BQ$3,Table!$A:$M,$I18,0))","v":""},{"$f":"IF(BR$3=\"\",\"\",VLOOKUP(BR$3,Table!$A:$M,$I18,0))","v":""},{"$f":"IF(BS$3=\"\",\"\",VLOOKUP(BS$3,Table!$A:$M,$I18,0))","v":""},{"$f":"IF(BT$3=\"\",\"\",VLOOKUP(BT$3,Table!$A:$M,$I18,0))","v":""},{"$f":"IF(BU$3=\"\",\"\",VLOOKUP(BU$3,Table!$A:$M,$I18,0))","v":""},{"$f":"IF(BV$3=\"\",\"\",VLOOKUP(BV$3,Table!$A:$M,$I18,0))","v":""},{"$f":"IF(BW$3=\"\",\"\",VLOOKUP(BW$3,Table!$A:$M,$I18,0))","v":""},{"$f":"IF(BX$3=\"\",\"\",VLOOKUP(BX$3,Table!$A:$M,$I18,0))","v":""},{"$f":"IF(BY$3=\"\",\"\",VLOOKUP(BY$3,Table!$A:$M,$I18,0))","v":""},{"$f":"IF(BZ$3=\"\",\"\",VLOOKUP(BZ$3,Table!$A:$M,$I18,0))","v":""},{"$f":"IF(CA$3=\"\",\"\",VLOOKUP(CA$3,Table!$A:$M,$I18,0))","v":""},{"$f":"IF(CB$3=\"\",\"\",VLOOKUP(CB$3,Table!$A:$M,$I18,0))","v":""},{"$f":"IF(CC$3=\"\",\"\",VLOOKUP(CC$3,Table!$A:$M,$I18,0))","v":""}]
[4,"Program/Site Name",null,null,null,null,null,"00020",null,"g"]
[5,"Program/Site Address (Line One)",null,null,null,null,null,"00030",null,"h"]
[6,"Program/Site Address (Line Two)",null,null,null,null,null,"00040",null,"h"]
[7,"County Code (See manual Appendix A)",null,null,null,null,null,"00080",null,"h"]
[{"$f":"+A22+1","v":8},"Date Site Opened",null,null,null,null,null,"00090",null,"h"]
[9,"Actual Capacity",null,null,null,null,null,"00110",null,"h"]
[10,"Non-Residential Program/Sites",null,null,null,null,null,"00140",null,"h"]
[11,"Actual Days Program/Site Open",null,null,null,null,null,"00160",null,"h"]
[12,"Units of Service",null,null,null,null,null,"00120",null,"h"]
[13,"Program/Site Square Footage",null,null,null,null,null,"00150",null,"h"]
["Section B: Expense"]
[null,"PERSONAL SERVICES",null,null,null,null,null,null,null,null,null," "]
[{"$f":"+A28+1","v":14},"Personal Services-Program/Site & Program Admin (from CCR-4)",null,null,null,null,null,"11999",null,null,null,null,null,null,null,null,null,null,null,null,null,null,null,null,null,null,null,null,null,null,null,null,null,null,null,null,null,null,null,null,null,null,null,null,null,null,null,null,{"$f":"INDIRECT(ADDRESS(ROW(CCR_4!$B$24),COLUMN($J$1)+CCR_4!$A$2*AW$13-1,,,\"CFR_4\"))","v":{"$error":"#VALUE!"}},{"$f":"INDIRECT(ADDRESS(ROW(CCR_4!$B$24),COLUMN($J$1)+CCR_4!$A$2*AX$13-1,,,\"CFR_4\"))","v":{"$error":"#VALUE!"}},{"$f":"INDIRECT(ADDRESS(ROW(CCR_4!$B$24),COLUMN($J$1)+CCR_4!$A$2*AY$13-1,,,\"CFR_4\"))","v":{"$error":"#VALUE!"}},{"$f":"INDIRECT(ADDRESS(ROW(CCR_4!$B$24),COLUMN($J$1)+CCR_4!$A$2*AZ$13-1,,,\"CFR_4\"))","v":{"$error":"#VALUE!"}},{"$f":"INDIRECT(ADDRESS(ROW(CCR_4!$B$24),COLUMN($J$1)+CCR_4!$A$2*BA$13-1,,,\"CFR_4\"))","v":{"$error":"#VALUE!"}},{"$f":"INDIRECT(ADDRESS(ROW(CCR_4!$B$24),COLUMN($J$1)+CCR_4!$A$2*BB$13-1,,,\"CFR_4\"))","v":{"$error":"#VALUE!"}},{"$f":"INDIRECT(ADDRESS(ROW(CCR_4!$B$24),COLUMN($J$1)+CCR_4!$A$2*BC$13-1,,,\"CFR_4\"))","v":{"$error":"#VALUE!"}},{"$f":"INDIRECT(ADDRESS(ROW(CCR_4!$B$24),COLUMN($J$1)+CCR_4!$A$2*BD$13-1,,,\"CFR_4\"))","v":{"$error":"#VALUE!"}},{"$f":"INDIRECT(ADDRESS(ROW(CCR_4!$B$24),COLUMN($J$1)+CCR_4!$A$2*BE$13-1,,,\"CFR_4\"))","v":{"$error":"#VALUE!"}},{"$f":"INDIRECT(ADDRESS(ROW(CCR_4!$B$24),COLUMN($J$1)+CCR_4!$A$2*BF$13-1,,,\"CFR_4\"))","v":{"$error":"#VALUE!"}},{"$f":"INDIRECT(ADDRESS(ROW(CCR_4!$B$24),COLUMN($J$1)+CCR_4!$A$2*BG$13-1,,,\"CFR_4\"))","v":{"$error":"#VALUE!"}},{"$f":"INDIRECT(ADDRESS(ROW(CCR_4!$B$24),COLUMN($J$1)+CCR_4!$A$2*BH$13-1,,,\"CFR_4\"))","v":{"$error":"#VALUE!"}},{"$f":"INDIRECT(ADDRESS(ROW(CCR_4!$B$24),COLUMN($J$1)+CCR_4!$A$2*BI$13-1,,,\"CFR_4\"))","v":{"$error":"#VALUE!"}},{"$f":"INDIRECT(ADDRESS(ROW(CCR_4!$B$24),COLUMN($J$1)+CCR_4!$A$2*BJ$13-1,,,\"CFR_4\"))","v":{"$error":"#VALUE!"}},{"$f":"INDIRECT(ADDRESS(ROW(CCR_4!$B$24),COLUMN($J$1)+CCR_4!$A$2*BK$13-1,,,\"CFR_4\"))","v":{"$error":"#VALUE!"}},{"$f":"INDIRECT(ADDRESS(ROW(CCR_4!$B$24),COLUMN($J$1)+CCR_4!$A$2*BL$13-1,,,\"CFR_4\"))","v":{"$error":"#VALUE!"}},{"$f":"INDIRECT(ADDRESS(ROW(CCR_4!$B$24),COLUMN($J$1)+CCR_4!$A$2*BM$13-1,,,\"CFR_4\"))","v":{"$error":"#VALUE!"}},{"$f":"INDIRECT(ADDRESS(ROW(CCR_4!$B$24),COLUMN($J$1)+CCR_4!$A$2*BN$13-1,,,\"CFR_4\"))","v":{"$error":"#VALUE!"}},{"$f":"INDIRECT(ADDRESS(ROW(CCR_4!$B$24),COLUMN($J$1)+CCR_4!$A$2*BO$13-1,,,\"CFR_4\"))","v":{"$error":"#VALUE!"}},{"$f":"INDIRECT(ADDRESS(ROW(CCR_4!$B$24),COLUMN($J$1)+CCR_4!$A$2*BP$13-1,,,\"CFR_4\"))","v":{"$error":"#VALUE!"}},{"$f":"INDIRECT(ADDRESS(ROW(CCR_4!$B$24),COLUMN($J$1)+CCR_4!$A$2*BQ$13-1,,,\"CFR_4\"))","v":{"$error":"#VALUE!"}},{"$f":"INDIRECT(ADDRESS(ROW(CCR_4!$B$24),COLUMN($J$1)+CCR_4!$A$2*BR$13-1,,,\"CFR_4\"))","v":{"$error":"#VALUE!"}},{"$f":"INDIRECT(ADDRESS(ROW(CCR_4!$B$24),COLUMN($J$1)+CCR_4!$A$2*BS$13-1,,,\"CFR_4\"))","v":{"$error":"#VALUE!"}},{"$f":"INDIRECT(ADDRESS(ROW(CCR_4!$B$24),COLUMN($J$1)+CCR_4!$A$2*BT$13-1,,,\"CFR_4\"))","v":{"$error":"#VALUE!"}},{"$f":"INDIRECT(ADDRESS(ROW(CCR_4!$B$24),COLUMN($J$1)+CCR_4!$A$2*BU$13-1,,,\"CFR_4\"))","v":{"$error":"#VALUE!"}},{"$f":"INDIRECT(ADDRESS(ROW(CCR_4!$B$24),COLUMN($J$1)+CCR_4!$A$2*BV$13-1,,,\"CFR_4\"))","v":{"$error":"#VALUE!"}},{"$f":"INDIRECT(ADDRESS(ROW(CCR_4!$B$24),COLUMN($J$1)+CCR_4!$A$2*BW$13-1,,,\"CFR_4\"))","v":{"$error":"#VALUE!"}},{"$f":"INDIRECT(ADDRESS(ROW(CCR_4!$B$24),COLUMN($J$1)+CCR_4!$A$2*BX$13-1,,,\"CFR_4\"))","v":{"$error":"#VALUE!"}},{"$f":"INDIRECT(ADDRESS(ROW(CCR_4!$B$24),COLUMN($J$1)+CCR_4!$A$2*BY$13-1,,,\"CFR_4\"))","v":{"$error":"#VALUE!"}},{"$f":"INDIRECT(ADDRESS(ROW(CCR_4!$B$24),COLUMN($J$1)+CCR_4!$A$2*BZ$13-1,,,\"CFR_4\"))","v":{"$error":"#VALUE!"}},{"$f":"INDIRECT(ADDRESS(ROW(CCR_4!$B$24),COLUMN($J$1)+CCR_4!$A$2*CA$13-1,,,\"CFR_4\"))","v":{"$error":"#VALUE!"}},{"$f":"INDIRECT(ADDRESS(ROW(CCR_4!$B$24),COLUMN($J$1)+CCR_4!$A$2*CB$13-1,,,\"CFR_4\"))","v":{"$error":"#VALUE!"}},{"$f":"INDIRECT(ADDRESS(ROW(CCR_4!$B$24),COLUMN($J$1)+CCR_4!$A$2*CC$13-1,,,\"CFR_4\"))","v":{"$error":"#VALUE!"}}]
[{"$f":"+A31+1","v":15},"Vacation Accruals-Program/Site & Program Admin",null,null,null,null,null,"12999"]
[null,"FRINGE BEEFITS"]
[{"$f":"+A32+1","v":16},"Mandated Fringe Benefits",null,null,null,null,null,"13200"]
[{"$f":"+A34+1","v":17},"Non-Mandated Fringe Benefits",null,null,null,null,null,"13300"]
[{"$f":"+A35+1","v":18},{"$f":"\"Total Fringe Benefits (Sum Lines \" &$A$34 & \" & \" &$A$35 &\")\"","v":"Total Fringe Benefits (Sum Lines 16 & 17)"},null,null,null,null,null,"13999",null,{"$f":"J34+J35","v":0},{"$f":"K34+K35","v":0},0,0,0,0,0,0,0,0,0,0,0,0,0,0,0,0,0,0,0,0,0,0,0,0,0,0,0,0,0,0,0,0,0,0,0,0,0,{"$f":"+SUM(AW$34:AW$35)","v":0},0,0,0,0,0,0,0,0,0,0,0,0,0,0,0,0,0,0,0,0,0,0,0,0,0,{"$f":"+SUM(BW$34:BW$35)","v":0},0,0,0,0,0,0]
[null,"OTHER THAN PERSONAL SERVICES (OTPS)"]
[{"$f":"+A36+1","v":19},"Food",null,null,null,null,null,"14010"]
[{"$f":"+A38+1","v":20},"Repairs and Maintenance",null,null,null,null,null,"14020"]
[21,"Utilities",null,null,null,null,null,"14030"]
[22,"Transportation Related-Participant",null,null,null,null,null,"14040"]
[23,"Staff Travel",null,null,null,null,null,"14250"]
[24,"Participant Incidentals",null,null,null,null,null,"14050"]
[{"$f":"+A43+1","v":25},"Expensed Equipment",null,null,null,null,null,"14080"]
[{"$f":"+A44+1","v":26},"Staff Development",null,null,null,null,null,"14140"]
[27,"Contracted Direct Care and Clinical Personal Service (from CCR-4A)",null,null,null,null,null,"14150",null,null,null,null,null,null,null,null,null,null,null,null,null,null,null,null,null,null,null,null,null,null,null,null,null,null,null,null,null,null,null,null,null,null,null,null,null,null,null,null,{"$f":"INDIRECT(ADDRESS(ROW(CCR_4A!$B$21),COLUMN($J$1)+AW$13*CCR_4A!$A$2-1,,,\"CFR_4A\"))","v":{"$error":"#VALUE!"}},{"$f":"INDIRECT(ADDRESS(ROW(CCR_4A!$B$21),COLUMN($J$1)+AX$13*CCR_4A!$A$2-1,,,\"CFR_4A\"))","v":{"$error":"#VALUE!"}},{"$f":"INDIRECT(ADDRESS(ROW(CCR_4A!$B$21),COLUMN($J$1)+AY$13*CCR_4A!$A$2-1,,,\"CFR_4A\"))","v":{"$error":"#VALUE!"}},{"$f":"INDIRECT(ADDRESS(ROW(CCR_4A!$B$21),COLUMN($J$1)+AZ$13*CCR_4A!$A$2-1,,,\"CFR_4A\"))","v":{"$error":"#VALUE!"}},{"$f":"INDIRECT(ADDRESS(ROW(CCR_4A!$B$21),COLUMN($J$1)+BA$13*CCR_4A!$A$2-1,,,\"CFR_4A\"))","v":{"$error":"#VALUE!"}},{"$f":"INDIRECT(ADDRESS(ROW(CCR_4A!$B$21),COLUMN($J$1)+BB$13*CCR_4A!$A$2-1,,,\"CFR_4A\"))","v":{"$error":"#VALUE!"}},{"$f":"INDIRECT(ADDRESS(ROW(CCR_4A!$B$21),COLUMN($J$1)+BC$13*CCR_4A!$A$2-1,,,\"CFR_4A\"))","v":{"$error":"#VALUE!"}},{"$f":"INDIRECT(ADDRESS(ROW(CCR_4A!$B$21),COLUMN($J$1)+BD$13*CCR_4A!$A$2-1,,,\"CFR_4A\"))","v":{"$error":"#VALUE!"}},{"$f":"INDIRECT(ADDRESS(ROW(CCR_4A!$B$21),COLUMN($J$1)+BE$13*CCR_4A!$A$2-1,,,\"CFR_4A\"))","v":{"$error":"#VALUE!"}},{"$f":"INDIRECT(ADDRESS(ROW(CCR_4A!$B$21),COLUMN($J$1)+BF$13*CCR_4A!$A$2-1,,,\"CFR_4A\"))","v":{"$error":"#VALUE!"}},{"$f":"INDIRECT(ADDRESS(ROW(CCR_4A!$B$21),COLUMN($J$1)+BG$13*CCR_4A!$A$2-1,,,\"CFR_4A\"))","v":{"$error":"#VALUE!"}},{"$f":"INDIRECT(ADDRESS(ROW(CCR_4A!$B$21),COLUMN($J$1)+BH$13*CCR_4A!$A$2-1,,,\"CFR_4A\"))","v":{"$error":"#VALUE!"}},{"$f":"INDIRECT(ADDRESS(ROW(CCR_4A!$B$21),COLUMN($J$1)+BI$13*CCR_4A!$A$2-1,,,\"CFR_4A\"))","v":{"$error":"#VALUE!"}},{"$f":"INDIRECT(ADDRESS(ROW(CCR_4A!$B$21),COLUMN($J$1)+BJ$13*CCR_4A!$A$2-1,,,\"CFR_4A\"))","v":{"$error":"#VALUE!"}},{"$f":"INDIRECT(ADDRESS(ROW(CCR_4A!$B$21),COLUMN($J$1)+BK$13*CCR_4A!$A$2-1,,,\"CFR_4A\"))","v":{"$error":"#VALUE!"}},{"$f":"INDIRECT(ADDRESS(ROW(CCR_4A!$B$21),COLUMN($J$1)+BL$13*CCR_4A!$A$2-1,,,\"CFR_4A\"))","v":{"$error":"#VALUE!"}},{"$f":"INDIRECT(ADDRESS(ROW(CCR_4A!$B$21),COLUMN($J$1)+BM$13*CCR_4A!$A$2-1,,,\"CFR_4A\"))","v":{"$error":"#VALUE!"}},{"$f":"INDIRECT(ADDRESS(ROW(CCR_4A!$B$21),COLUMN($J$1)+BN$13*CCR_4A!$A$2-1,,,\"CFR_4A\"))","v":{"$error":"#VALUE!"}},{"$f":"INDIRECT(ADDRESS(ROW(CCR_4A!$B$21),COLUMN($J$1)+BO$13*CCR_4A!$A$2-1,,,\"CFR_4A\"))","v":{"$error":"#VALUE!"}},{"$f":"INDIRECT(ADDRESS(ROW(CCR_4A!$B$21),COLUMN($J$1)+BP$13*CCR_4A!$A$2-1,,,\"CFR_4A\"))","v":{"$error":"#VALUE!"}},{"$f":"INDIRECT(ADDRESS(ROW(CCR_4A!$B$21),COLUMN($J$1)+BQ$13*CCR_4A!$A$2-1,,,\"CFR_4A\"))","v":{"$error":"#VALUE!"}},{"$f":"INDIRECT(ADDRESS(ROW(CCR_4A!$B$21),COLUMN($J$1)+BR$13*CCR_4A!$A$2-1,,,\"CFR_4A\"))","v":{"$error":"#VALUE!"}},{"$f":"INDIRECT(ADDRESS(ROW(CCR_4A!$B$21),COLUMN($J$1)+BS$13*CCR_4A!$A$2-1,,,\"CFR_4A\"))","v":{"$error":"#VALUE!"}},{"$f":"INDIRECT(ADDRESS(ROW(CCR_4A!$B$21),COLUMN($J$1)+BT$13*CCR_4A!$A$2-1,,,\"CFR_4A\"))","v":{"$error":"#VALUE!"}},{"$f":"INDIRECT(ADDRESS(ROW(CCR_4A!$B$21),COLUMN($J$1)+BU$13*CCR_4A!$A$2-1,,,\"CFR_4A\"))","v":{"$error":"#VALUE!"}},{"$f":"INDIRECT(ADDRESS(ROW(CCR_4A!$B$21),COLUMN($J$1)+BV$13*CCR_4A!$A$2-1,,,\"CFR_4A\"))","v":{"$error":"#VALUE!"}},{"$f":"INDIRECT(ADDRESS(ROW(CCR_4A!$B$21),COLUMN($J$1)+BW$13*CCR_4A!$A$2-1,,,\"CFR_4A\"))","v":{"$error":"#VALUE!"}},{"$f":"INDIRECT(ADDRESS(ROW(CCR_4A!$B$21),COLUMN($J$1)+BX$13*CCR_4A!$A$2-1,,,\"CFR_4A\"))","v":{"$error":"#VALUE!"}},{"$f":"INDIRECT(ADDRESS(ROW(CCR_4A!$B$21),COLUMN($J$1)+BY$13*CCR_4A!$A$2-1,,,\"CFR_4A\"))","v":{"$error":"#VALUE!"}},{"$f":"INDIRECT(ADDRESS(ROW(CCR_4A!$B$21),COLUMN($J$1)+BZ$13*CCR_4A!$A$2-1,,,\"CFR_4A\"))","v":{"$error":"#VALUE!"}},{"$f":"INDIRECT(ADDRESS(ROW(CCR_4A!$B$21),COLUMN($J$1)+CA$13*CCR_4A!$A$2-1,,,\"CFR_4A\"))","v":{"$error":"#VALUE!"}},{"$f":"INDIRECT(ADDRESS(ROW(CCR_4A!$B$21),COLUMN($J$1)+CB$13*CCR_4A!$A$2-1,,,\"CFR_4A\"))","v":{"$error":"#VALUE!"}},{"$f":"INDIRECT(ADDRESS(ROW(CCR_4A!$B$21),COLUMN($J$1)+CC$13*CCR_4A!$A$2-1,,,\"CFR_4A\"))","v":{"$error":"#VALUE!"}}]
[28,"Supplies and Materials - Non-Household",null,null,null,null,null,"14160"]
[29,"Household Supplies",null,null,null,null,null,"14170"]
[30,"Telephone, Cable and Internet",null,null,null,null,null,"14190"]
[31,"Insurance - General",null,null,null,null,null,"14260"]
[32,"Other (Detail Required)",null,null,null,null,null,"14998"]
[33,{"$f":"\"Total Other Than Personal Services (Sum Lines \" & $A$38 & \"-\" &$A$51 &\")\"","v":"Total Other Than Personal Services (Sum Lines 19-32)"},null,null,null,null,null,"14999",null,{"$f":"J38+J39+J40+J41+J42+J43+J44+J45+J46+J47+J48+J49+J50+J51","v":0},{"$f":"K38+K39+K40+K41+K42+K43+K44+K45+K46+K47+K48+K49+K50+K51","v":0},0,0,0,0,0,0,0,0,0,0,0,0,0,0,0,0,0,0,0,0,0,0,0,0,0,0,0,0,0,0,0,0,0,0,0,0,0,{"$f":"+SUM(AW$38:AW$51)","v":{"$error":"#VALUE!"}},{"$error":"#VALUE!"},{"$error":"#VALUE!"},{"$error":"#VALUE!"},{"$error":"#VALUE!"},{"$error":"#VALUE!"},{"$error":"#VALUE!"},{"$error":"#VALUE!"},{"$error":"#VALUE!"},{"$error":"#VALUE!"},{"$error":"#VALUE!"},{"$error":"#VALUE!"},{"$error":"#VALUE!"},{"$error":"#VALUE!"},{"$error":"#VALUE!"},{"$error":"#VALUE!"},{"$error":"#VALUE!"},{"$error":"#VALUE!"},{"$error":"#VALUE!"},{"$error":"#VALUE!"},{"$error":"#VALUE!"},{"$error":"#VALUE!"},{"$error":"#VALUE!"},{"$error":"#VALUE!"},{"$error":"#VALUE!"},{"$f":"+SUM(BV$38:BV$51)","v":{"$error":"#VALUE!"}},{"$error":"#VALUE!"},{"$error":"#VALUE!"},{"$error":"#VALUE!"},{"$error":"#VALUE!"},{"$error":"#VALUE!"},{"$error":"#VALUE!"},{"$error":"#VALUE!"}]
[null,"EQUIPMENT-PROVIDER PAID"]
[{"$f":"+A52+1","v":34},"Lease/Rental Vehicle",null,null,null,null,null,"15010"]
[{"$f":"+A54+1","v":35},"Lease/Rental Equipment",null,null,null,null,null,"15020"]
[36,"Depreciation-Vehicle ",null,null,null,null,null,"15040"]
[37,"Depreciation-Equipment ",null,null,null,null,null,"15050"]
[38,"Interest-Vehicle",null,null,null,null,null,"15070"]
[39,"Other (Detail Required)",null,null,null,null,null,"15998"]
[40,{"$f":"\"Total Equipment (Sum of Lines \" & $A$54 & \"-\" &$A$59 &\")\"","v":"Total Equipment (Sum of Lines 34-39)"},null,null,null,null,null,"15999",null,{"$f":"J54+J55+J56+J57+J58+J59","v":0},{"$f":"K54+K55+K56+K57+K58+K59","v":0},0,0,0,0,0,0,0,0,0,0,0,0,0,0,0,0,0,0,0,0,0,0,0,0,0,0,0,0,0,0,0,0,0,0,0,0,0,{"$f":"+SUM(AW$54:AW$59)","v":0},0,0,0,0,0,0,0,0,0,0,0,0,0,0,0,0,0,0,0,0,0,0,0,0,0,{"$f":"+SUM(BW$54:BW$59)","v":0},0,0,0,0,0,0]
[null,"PROPERTY-PROVIDER PAID"]
[{"$f":"+A60+1","v":41},"Lease/Rental-Real Property",null,null,null,null,null,"16010"]
[{"$f":"+A62+1","v":42},"Leasehold/Leasehold Improvements",null,null,null,null,null,"16020"]
[43,"Depreciation-Building",null,null,null,null,null,"16030"]
[44,"Insurance-Property & Casualty",null,null,null,null,null,"16080"]
[45,"Interest on Capital Indebtedness",null,null,null,null,null,"16100"]
[46,"Other (Detail Required)",null,null,null,null,null,"16998"]
[47,{"$f":"\"Total Property-Provider Paid (Sum of Lines \" &$A$62 &\"-\" & $A$67 &\")\"","v":"Total Property-Provider Paid (Sum of Lines 41-46)"},null,null,null,null,null,"16999",null,{"$f":"J62+J63+J64+J65+J66+J67","v":0},{"$f":"K62+K63+K64+K65+K66+K67","v":0},0,0,0,0,0,0,0,0,0,0,0,0,0,0,0,0,0,0,0,0,0,0,0,0,0,0,0,0,0,0,0,0,0,0,0,0,0,{"$f":"SUM(AW$62:AW$67)","v":0},0,0,0,0,0,0,0,0,0,0,0,0,0,0,0,0,0,0,0,0,0,0,0,0,0,{"$f":"SUM(BW$62:BW$67)","v":0},0,0,0,0,0,0]
[null,"TOTALS"]
[{"$f":"+A68+1","v":48},{"$f":"\"Total Operating Costs (Sum lines \"&$A$31&\", \"&$A$32&\", \"&$A$36&\" and \"&$A$52 &\")\"","v":"Total Operating Costs (Sum lines 14, 15, 18 and 33)"},null,null,null,null,null,"19010",null,{"$f":"J31+J32+J36+J52","v":0},{"$f":"K31+K32+K36+K52","v":0},0,0,0,0,0,0,0,0,0,0,0,0,0,0,0,0,0,0,0,0,0,0,0,0,0,0,0,0,0,0,0,0,0,0,0,0,0,{"$f":"+AW$31+AW$32+AW$36+AW$52","v":{"$error":"#VALUE!"}},{"$error":"#VALUE!"},{"$error":"#VALUE!"},{"$error":"#VALUE!"},{"$error":"#VALUE!"},{"$error":"#VALUE!"},{"$error":"#VALUE!"},{"$error":"#VALUE!"},{"$error":"#VALUE!"},{"$error":"#VALUE!"},{"$error":"#VALUE!"},{"$error":"#VALUE!"},{"$error":"#VALUE!"},{"$error":"#VALUE!"},{"$error":"#VALUE!"},{"$error":"#VALUE!"},{"$error":"#VALUE!"},{"$error":"#VALUE!"},{"$error":"#VALUE!"},{"$error":"#VALUE!"},{"$error":"#VALUE!"},{"$error":"#VALUE!"},{"$error":"#VALUE!"},{"$error":"#VALUE!"},{"$error":"#VALUE!"},{"$f":"+BV$31+BV$32+BV$36+BV$52","v":{"$error":"#VALUE!"}},{"$error":"#VALUE!"},{"$error":"#VALUE!"},{"$error":"#VALUE!"},{"$error":"#VALUE!"},{"$error":"#VALUE!"},{"$error":"#VALUE!"},{"$error":"#VALUE!"}]
[{"$f":"+A70+1","v":49},{"$f":"\"Agency Admin. Alloc.(Line \"&$A$70&\" times Ajusted Ratio Factor (CFR-3))\"","v":"Agency Admin. Alloc.(Line 48 times Ajusted Ratio Factor (CFR-3))"},null,null,null,null,null,"19050",null,null,null,null,null,null,null,null,null,null,null,null,null,null,null,null,null,null,null,null,null,null,null,null,null,null,null,null,null,null,null,null,null,null,null,null,null,null,null,null,{"$f":"+AW$70*VLOOKUP(AW$14,CCR_3!$I$86:$J$90,2,0)","v":{"$error":"#VALUE!"}},{"$f":"+AX$70*VLOOKUP(AX$14,CCR_3!$I$86:$J$90,2,0)","v":{"$error":"#VALUE!"}},{"$f":"+AY$70*VLOOKUP(AY$14,CCR_3!$I$86:$J$90,2,0)","v":{"$error":"#VALUE!"}},{"$f":"+AZ$70*VLOOKUP(AZ$14,CCR_3!$I$86:$J$90,2,0)","v":{"$error":"#VALUE!"}},{"$f":"+BA$70*VLOOKUP(BA$14,CCR_3!$I$86:$J$90,2,0)","v":{"$error":"#VALUE!"}},{"$f":"+BB$70*VLOOKUP(BB$14,CCR_3!$I$86:$J$90,2,0)","v":{"$error":"#VALUE!"}},{"$f":"+BC$70*VLOOKUP(BC$14,CCR_3!$I$86:$J$90,2,0)","v":{"$error":"#VALUE!"}},{"$f":"+BD$70*VLOOKUP(BD$14,CCR_3!$I$86:$J$90,2,0)","v":{"$error":"#VALUE!"}},{"$f":"+BE$70*VLOOKUP(BE$14,CCR_3!$I$86:$J$90,2,0)","v":{"$error":"#VALUE!"}},{"$f":"+BF$70*VLOOKUP(BF$14,CCR_3!$I$86:$J$90,2,0)","v":{"$error":"#VALUE!"}},{"$f":"+BG$70*VLOOKUP(BG$14,CCR_3!$I$86:$J$90,2,0)","v":{"$error":"#VALUE!"}},{"$f":"+BH$70*VLOOKUP(BH$14,CCR_3!$I$86:$J$90,2,0)","v":{"$error":"#VALUE!"}},{"$f":"+BI$70*VLOOKUP(BI$14,CCR_3!$I$86:$J$90,2,0)","v":{"$error":"#VALUE!"}},{"$f":"+BJ$70*VLOOKUP(BJ$14,CCR_3!$I$86:$J$90,2,0)","v":{"$error":"#VALUE!"}},{"$f":"+BK$70*VLOOKUP(BK$14,CCR_3!$I$86:$J$90,2,0)","v":{"$error":"#VALUE!"}},{"$f":"+BL$70*VLOOKUP(BL$14,CCR_3!$I$86:$J$90,2,0)","v":{"$error":"#VALUE!"}},{"$f":"+BM$70*VLOOKUP(BM$14,CCR_3!$I$86:$J$90,2,0)","v":{"$error":"#VALUE!"}},{"$f":"+BN$70*VLOOKUP(BN$14,CCR_3!$I$86:$J$90,2,0)","v":{"$error":"#VALUE!"}},{"$f":"+BO$70*VLOOKUP(BO$14,CCR_3!$I$86:$J$90,2,0)","v":{"$error":"#VALUE!"}},{"$f":"+BP$70*VLOOKUP(BP$14,CCR_3!$I$86:$J$90,2,0)","v":{"$error":"#VALUE!"}},{"$f":"+BQ$70*VLOOKUP(BQ$14,CCR_3!$I$86:$J$90,2,0)","v":{"$error":"#VALUE!"}},{"$f":"+BR$70*VLOOKUP(BR$14,CCR_3!$I$86:$J$90,2,0)","v":{"$error":"#VALUE!"}},{"$f":"+BS$70*VLOOKUP(BS$14,CCR_3!$I$86:$J$90,2,0)","v":{"$error":"#VALUE!"}},{"$f":"+BT$70*VLOOKUP(BT$14,CCR_3!$I$86:$J$90,2,0)","v":{"$error":"#VALUE!"}},{"$f":"+BU$70*VLOOKUP(BU$14,CCR_3!$I$86:$J$90,2,0)","v":{"$error":"#VALUE!"}},{"$f":"+BV$70*VLOOKUP(BV$14,CCR_3!$I$86:$J$90,2,0)","v":{"$error":"#VALUE!"}},{"$f":"+BW$70*VLOOKUP(BW$14,CCR_3!$I$86:$J$90,2,0)","v":{"$error":"#VALUE!"}},{"$f":"+BX$70*VLOOKUP(BX$14,CCR_3!$I$86:$J$90,2,0)","v":{"$error":"#VALUE!"}},{"$f":"+BY$70*VLOOKUP(BY$14,CCR_3!$I$86:$J$90,2,0)","v":{"$error":"#VALUE!"}},{"$f":"+BZ$70*VLOOKUP(BZ$14,CCR_3!$I$86:$J$90,2,0)","v":{"$error":"#VALUE!"}},{"$f":"+CA$70*VLOOKUP(CA$14,CCR_3!$I$86:$J$90,2,0)","v":{"$error":"#VALUE!"}},{"$f":"+CB$70*VLOOKUP(CB$14,CCR_3!$I$86:$J$90,2,0)","v":{"$error":"#VALUE!"}},{"$f":"+CC$70*VLOOKUP(CC$14,CCR_3!$I$86:$J$90,2,0)","v":{"$error":"#VALUE!"}}]
[{"$f":"+A71+1","v":50},"Adjustments/Non-Allowable Costs (Detail Required)",null,null,null,null,null,"19030"]
[{"$f":"+A72+1","v":51},{"$f":"\"Total Prog/Site Costs (Sum lines \" & $A$60 &\", \" & $A$68 &\"-\" &$A$71 & \" minus \" & $A$72 &\")\"","v":"Total Prog/Site Costs (Sum lines 40, 47-49 minus 50)"},null,null,null,null,null,"19060",null,{"$f":"J60+J68+J70+J71-J72","v":0},{"$f":"K60+K68+K70+K71-K72","v":0},0,0,0,0,0,0,0,0,0,0,0,0,0,0,0,0,0,0,0,0,0,0,0,0,0,0,0,0,0,0,0,0,0,0,0,0,0,{"$f":"+AW$60+AW$68+AW$70+AW$71-AW$72","v":{"$error":"#VALUE!"}},{"$error":"#VALUE!"},{"$error":"#VALUE!"},{"$error":"#VALUE!"},{"$error":"#VALUE!"},{"$error":"#VALUE!"},{"$error":"#VALUE!"},{"$error":"#VALUE!"},{"$error":"#VALUE!"},{"$error":"#VALUE!"},{"$error":"#VALUE!"},{"$error":"#VALUE!"},{"$error":"#VALUE!"},{"$error":"#VALUE!"},{"$error":"#VALUE!"},{"$error":"#VALUE!"},{"$error":"#VALUE!"},{"$error":"#VALUE!"},{"$error":"#VALUE!"},{"$error":"#VALUE!"},{"$error":"#VALUE!"},{"$error":"#VALUE!"},{"$error":"#VALUE!"},{"$error":"#VALUE!"},{"$error":"#VALUE!"},{"$error":"#VALUE!"},{"$f":"+BW$60+BW$68+BW$70+BW$71-BW$72","v":{"$error":"#VALUE!"}},{"$error":"#VALUE!"},{"$error":"#VALUE!"},{"$error":"#VALUE!"},{"$error":"#VALUE!"},{"$error":"#VALUE!"},{"$error":"#VALUE!"}]
[null,"OPWDD Only - Informational"]
[{"$f":"+A73+1","v":52},"Other Than To/From Transportation Allocation",null,null,null,null,null,"19101"]

{"sheet":"CCR_2","index":2,"n_rows":42,"n_cols":17,"rows_kept":42,"cut":false,"hidden":false,"merged":[[3,9,3,13],[4,9,4,13],[6,0,6,1],[6,2,6,5],[7,0,7,1],[3,2,3,7],[4,2,4,7],[5,6,5,7],[3,0,3,1],[5,0,5,5],[2,2,2,3],[10,0,11,0],[10,1,10,6],[10,7,11,7],[11,1,11,6],[8,0,8,1],[2,4,2,5],[2,6,2,7],[2,0,2,1]]}
[{"$f":"COLUMN()","v":1},{"$f":"COLUMN()","v":2},{"$f":"COLUMN()","v":3},{"$f":"COLUMN()","v":4},{"$f":"COLUMN()","v":5},{"$f":"COLUMN()","v":6},{"$f":"COLUMN()","v":7},{"$f":"COLUMN()","v":8},null,{"$f":"COLUMN()","v":10},{"$f":"COLUMN()","v":11},{"$f":"COLUMN()","v":12},{"$f":"COLUMN()","v":13},{"$f":"COLUMN()","v":14},{"$f":"COLUMN()","v":15},{"$f":"COLUMN()","v":16},{"$f":"COLUMN()","v":17}]
[]
["TBI Provider ID",null,{"$f":"+IF(CCR_0!$C$4=\"\",\"\",CCR_0!$C$4)","v":""},null,"NHTD Provider ID ",null,{"$f":"+IF(CCR_0!$G$4=\"\",\"\",CCR_0!$G$4)","v":""}]
["Agency Name",null,{"$f":"+IF(CCR_0!$C$5=\"\",\"\",IF(LEFT(CCR_0!$C$5,5) = \"C1010\", CCR_0!$C$6,CCR_0!$C$5))","v":""},null,null,null,null,null,null,"NEW YORK STATE"]
["New Agency",null,null,null,null,null,null,null,null,"CERTIFIED COST REPORT"]
["Funding State Agency",null,null,null,null,null,"Reporting Period"]
[null,null,"DOH",null,null,null,"Start Date","End Date",null,"SCHEDULE CCR-2"]
[null,null,"TBI","NHTD",null,null,"mm/dd/yyyy","mm/dd/yyyy",null,"AGENCY FISCAL"]
["NO",null,{"$f":"IF(CCR_0!C$10=\"\",\"\",CCR_0!C$10)","v":""},{"$f":"IF(CCR_0!D$10=\"\",\"\",CCR_0!D$10)","v":""},"NO",null,{"$f":"IF(CCR_1!G$10=\"\",\"\", CCR_1!G$10)","v":""},{"$f":"IF(CCR_1!H$10=\"\",\"\", CCR_1!H$10)","v":""},null,"SUMMARY",null,null,null,"Rev. Feb. 2021"]
[]
["Line No.","Column Number",null,null,null,null,null,"Cost Codes",null,1,{"$f":"+J11+1","v":2},{"$f":"+K11+1","v":3},4,5,6,7,8]
[null,"Item Description",null,null,null,null,null,null,null,"Agency Totals\n(Sum Col. 2-7)",{"$f":"+K$13&\" \" & \"Total\"","v":"OCFS Total"},{"$f":"+L$13&\" \" & \"Total\"","v":"TBI Total"},{"$f":"+M$13&\" \" & \"Total\"","v":"NHTD Total"},"CAH I & II Total","CAH II Total","Shared\nProgram\nTotal*","Other Programs Total"]
[null,"Expense",null,null,null,null,null,null,null,null,"OCFS","TBI","NHTD","CAH I & II","CAH II","CAH II","CAH II"]
[{"$f":"+A13+1","v":1},"Personal Services ",null,null,null,null,{"$f":"\"(CCR-1, Line \" & CCR_1!$A$31 &\")\"","v":"(CCR-1, Line 14)"},31999,null,{"$f":"+SUM(K14:Q14)","v":0},{"$f":"SUMIFS(CCR_1!$31:$31,CCR_1!$14:$14,K$13)","v":0},{"$f":"SUMIFS(CCR_1!$31:$31,CCR_1!$14:$14,L$13)","v":0},{"$f":"SUMIFS(CCR_1!$31:$31,CCR_1!$14:$14,M$13)","v":0},{"$f":"SUMIFS(CCR_1!$31:$31,CCR_1!$14:$14,N$13)","v":0},null,{"$f":"L14+M14","v":0},0]
[{"$f":"+A14+1","v":2},"Vacation Leave Accruals ",null,null,null,null,{"$f":"\"(CCR-1, Line \" & CCR_1!$A$32 &\")\"","v":"(CCR-1, Line 15)"},32999,null,{"$f":"+SUM(K15:Q15)","v":0},{"$f":"SUMIFS(CCR_1!$32:$32,CCR_1!$14:$14,K$13)","v":0},{"$f":"SUMIFS(CCR_1!$32:$32,CCR_1!$14:$14,L$13)","v":0},{"$f":"SUMIFS(CCR_1!$32:$32,CCR_1!$14:$14,M$13)","v":0},{"$f":"SUMIFS(CCR_1!$32:$32,CCR_1!$14:$14,N$13)","v":0},null,{"$f":"L15+M15","v":0},0]
[3,"Fringe Benefits ",null,null,null,null,{"$f":"\"(CCR-1, Line \" & CCR_1!$A$36 &\")\"","v":"(CCR-1, Line 18)"},33999,null,0,{"$f":"SUMIFS(CCR_1!$36:$36,CCR_1!$14:$14,K$13)","v":0},{"$f":"SUMIFS(CCR_1!$36:$36,CCR_1!$14:$14,L$13)","v":0},{"$f":"SUMIFS(CCR_1!$36:$36,CCR_1!$14:$14,M$13)","v":0},{"$f":"SUMIFS(CCR_1!$36:$36,CCR_1!$14:$14,N$13)","v":0},null,0,0]
[4,"OTPS ",null,null,null,null,{"$f":"\"(CCR-1, Line \" & CCR_1!$A$52 &\")\"","v":"(CCR-1, Line 33)"},34999,null,0,{"$f":"SUMIFS(CCR_1!$52:$52,CCR_1!$14:$14,K$13)","v":0},{"$f":"SUMIFS(CCR_1!$52:$52,CCR_1!$14:$14,L$13)","v":0},{"$f":"SUMIFS(CCR_1!$52:$52,CCR_1!$14:$14,M$13)","v":0},{"$f":"SUMIFS(CCR_1!$52:$52,CCR_1!$14:$14,N$13)","v":0},null,0,0]
[5,"Equipment-Provider Paid ",null,null,null,null,{"$f":"\"(CCR-1, Line \" & CCR_1!$A$60 &\")\"","v":"(CCR-1, Line 40)"},35999,null,0,{"$f":"SUMIFS(CCR_1!$60:$60,CCR_1!$14:$14,K$13)","v":0},{"$f":"SUMIFS(CCR_1!$60:$60,CCR_1!$14:$14,L$13)","v":0},{"$f":"SUMIFS(CCR_1!$60:$60,CCR_1!$14:$14,M$13)","v":0},{"$f":"SUMIFS(CCR_1!$60:$60,CCR_1!$14:$14,N$13)","v":0},null,0,0]
[6,"Property-Provider Paid ",null,null,null,null,{"$f":"\"(CCR-1, Line \" & CCR_1!$A$68 &\")\"","v":"(CCR-1, Line 47)"},36999,null,0,{"$f":"SUMIFS(CCR_1!$68:$68,CCR_1!$14:$14,K$13)","v":0},{"$f":"SUMIFS(CCR_1!$68:$68,CCR_1!$14:$14,L$13)","v":0},{"$f":"SUMIFS(CCR_1!$68:$68,CCR_1!$14:$14,M$13)","v":0},{"$f":"SUMIFS(CCR_1!$68:$68,CCR_1!$14:$14,N$13)","v":0},null,0,0]
[7,"Net Agency Admin. ",null,null,null,null,{"$f":"\"(CCR-1, Line \" & CCR_1!$A$71 &\")\"","v":"(CCR-1, Line 49)"},38050,null,0,{"$f":"SUMIFS(CCR_1!$71:$71,CCR_1!$14:$14,K$13)","v":0},{"$f":"SUMIFS(CCR_1!$71:$71,CCR_1!$14:$14,L$13)","v":0},{"$f":"SUMIFS(CCR_1!$71:$71,CCR_1!$14:$14,M$13)","v":0},{"$f":"SUMIFS(CCR_1!$71:$71,CCR_1!$14:$14,N$13)","v":0},null,0,0]
[8,"Adj./Non-Allow. Costs ",null,null,null,null,{"$f":"\"(CCR-1, Line \" & CCR_1!$A$72 &\")\"","v":"(CCR-1, Line 50)"},38030,null,0,{"$f":"SUMIFS(CCR_1!$72:$72,CCR_1!$14:$14,K$13)","v":0},{"$f":"SUMIFS(CCR_1!$72:$72,CCR_1!$14:$14,L$13)","v":0},{"$f":"SUMIFS(CCR_1!$72:$72,CCR_1!$14:$14,M$13)","v":0},{"$f":"SUMIFS(CCR_1!$72:$72,CCR_1!$14:$14,N$13)","v":0},null,0,0]
[9,"Total Adj. Expenses ",null,null,null,null,"(Sum Lines 1-7 minus 8)",38999,null,0,{"$f":"SUM(K14:K20)-K21","v":0},{"$f":"SUM(L14:L20)-L21","v":0},0,{"$f":"SUM(N14:N20)-N21","v":0},null,0,0]
[10,"REVENUES",null,null,null,null,null,"00100"]
[11,"10 Gross Revenues (CFR-1, Line 95) 40999",null,null,null,null,null,"00110"]
[12,"11 GAAP Adj. to Revenue (CFR-1, Line 99) 43999",null,null,null,null,null,"00160"]
[13,"12 Net GAAP Revenues (Line 10 minus Line 11) 44999",null,null,null,null,null,"00120"]
[14,"Respite or TUBS Units of Service (OPWDD only)",null,null,null,null,null,"00130"]
[15,"Program/Site Square Footage (OASAS, OPWDD and SED Only)",null,null,null,null,null,"00150"]
["Section B: Expense",null,null,null,null,null,null,""]
[null,"PERSONAL SERVICES"]
[16,"Personal Services - Program/Site & Program Admin (from CFR-4)",null,null,null,null,null,"11999"]
[17,"Vacation Accruals - Program/Site & Program Admin",null,null,null,null,null,"12999"]
[null,"FRINGE BEEFITS"]
[18,"Mandated Fringe Benefits",null,null,null,null,null,"13200"]
[19,"Non-Mandated Fringe Benefits",null,null,null,null,null,"13300"]
[20,"Total Fringe Benefits (Sum Lines 18 & 19)",null,null,null,null,null,"13999"]
[null,"OTHER THAN PERSONAL SERVICES OTPS)"]
[]
["THE RECONCILIATION SCHEDULE MUST BE COMPLETED WHEN:"]
["(1) the expenses and revenues in the CCR do not equal the expenses and revenues in the audited financial statements and"]
["(2) the reporting periods of the CCR and financial statements coincide."]
["*","These amounts are not detailed elsewhere in the CCR and, therefore, will not crossfoot to CCR-1."]

{"sheet":"CCR_3","index":3,"n_rows":97,"n_cols":12,"rows_kept":97,"cut":false,"hidden":false,"merged":[[2,2,2,3],[3,2,3,7],[4,2,4,7],[10,0,11,0],[10,1,10,6],[10,7,11,7],[11,1,11,6],[8,0,8,1],[2,4,2,5],[2,6,2,7],[5,6,5,7],[2,0,2,1],[3,0,3,1],[5,0,5,5],[94,1,95,11],[92,1,93,11],[96,1,98,11],[3,9,3,11],[4,9,4,11],[6,0,6,1],[6,2,6,5],[7,0,7,1]]}
[{"$f":"COLUMN()","v":1},{"$f":"COLUMN()","v":2},{"$f":"COLUMN()","v":3},{"$f":"COLUMN()","v":4},{"$f":"COLUMN()","v":5},{"$f":"COLUMN()","v":6},{"$f":"COLUMN()","v":7},{"$f":"COLUMN()","v":8},null,{"$f":"COLUMN()","v":10},{"$f":"COLUMN()","v":11},{"$f":"COLUMN()","v":12}]
[]
["TBI Provider ID",null,{"$f":"+IF(CCR_0!$C$4=\"\",\"\",CCR_0!$C$4)","v":""},null,"NHTD Provider ID ",null,{"$f":"+IF(CCR_0!$G$4=\"\",\"\",CCR_0!$G$4)","v":""}]
["Agency Name",null,{"$f":"+IF(CCR_0!$C$5=\"\",\"\",IF(LEFT(CCR_0!$C$5,5) = \"C1010\", CCR_0!$C$6,CCR_0!$C$5))","v":""},null,null,null,null,null,null,"NEW YORK STATE"]
["New Agency",null,null,null,null,null,null,null,null,"CERTIFIED COST REPORT"]
["Funding State Agency",null,null,null,null,null,"Reporting Period"]
[null,null,"DOH",null,null,null,"Start Date","End Date",null,"SCHEDULE CCR-3"]
[null,null,"TBI","NHTD",null,null,"mm/dd/yyyy","mm/dd/yyyy",null,"AGENCY"]
["NO",null,{"$f":"IF(CCR_0!C$10=\"\",\"\",CCR_0!C$10)","v":""},{"$f":"IF(CCR_0!D$10=\"\",\"\",CCR_0!D$10)","v":""},"NO",null,{"$f":"IF(CCR_1!G$10=\"\",\"\", CCR_1!G$10)","v":""},{"$f":"IF(CCR_1!H$10=\"\",\"\", CCR_1!H$10)","v":""},null,"ADMINISTRATION",null,"Rev. Feb. 2021"]
[]
["Line No.","Column Number",null,null,null,null,null,"Cost Codes",null,1]
[null,"Item Description",null,null,null,null,null,null,null,"Amount"]
[null,"PERSONAL SERVICES"]
[{"$f":"+A13+1","v":1},"Total Personal Services (from CCR-4, Agency Admin.)",null,null,null,null,null,11998]
[{"$f":"+A14+1","v":2},"Vacation Leave Accruals ",null,null,null,null,null,12998]
[null,"FRINGE BENEFITS"]
[{"$f":"+A15+1","v":3},"Mandated Fringe Benefits",null,null,null,null,null,13201]
[{"$f":"+A17+1","v":4},"Non-Mandated Fringe Benefits",null,null,null,null,null,13301]
[{"$f":"+A18+1","v":5},{"$f":"\"Total Fringe Benefits (Sum Lines \" &$A$17 &\" - \" &$A$18 &\")\"","v":"Total Fringe Benefits (Sum Lines 3 - 4)"},null,null,null,null,null,13998,null,{"$f":"J17+J18","v":0}]
[null,"OTHER THAN PERSONAL SERVICES (OTPS)"]
[{"$f":"+A19+1","v":6},"Audit/Legal/Accounting",null,null,null,null,null,14200]
[{"$f":"+A21+1","v":7},"Utilities",null,null,null,null,null,14210]
[{"$f":"+A22+1","v":8},"Telephone, Cable and Internet",null,null,null,null,null,14220]
[9,"Repairs and Maintenance",null,null,null,null,null,14021]
[10,"Office Supplies and Postage",null,null,null,null,null,14161]
[11,"Organizational Expense",null,null,null,null,null,14230]
[12,"Interest - Working Capital",null,null,null,null,null,14240]
[13,"Expensed Equipment",null,null,null,null,null,14081]
[14,"Contracted Personal Services",null,null,null,null,null,14151]
[15,"Staff Travel",null,null,null,null,null,14251]
[16,"Insurance - General",null,null,null,null,null,14261]
[17,"Other (Detail Required)",null,null,null,null,null,14997]
[18,{"$f":"\"Total OTPS (Sum Lines \" &$A$21 & \" - \" &$A$32 &\")\"","v":"Total OTPS (Sum Lines 6 - 17)"},null,null,null,null,null,74996,null,{"$f":"J21+J22+J23+J24+J25+J26+J27+J28+J29+J30+J31+J32","v":0}]
[null,"EQUIPMENT-PROVIDER PAID"]
[{"$f":"+A33+1","v":19},"Lease/Rental-Vehicle",null,null,null,null,null,15011]
[{"$f":"+A35+1","v":20},"Lease/Rental-Equipment",null,null,null,null,null,15030]
[21,"Depreciation-Vehicle",null,null,null,null,null,15041]
[22,"Depreciation-Equipment",null,null,null,null,null,15060]
[23,"Interest-Vehicle",null,null,null,null,null,15071]
[24,"Other (Detail Required)",null,null,null,null,null,15997]
[25,{"$f":"\"Total Equipment (Sum Lines \" &$A$35 &\" - \" &$A$40 &\")\"","v":"Total Equipment (Sum Lines 19 - 24)"},null,null,null,null,null,15996,null,{"$f":"J35+J36+J37+J38+J39+J40","v":0}]
[null,"PROPERTY-PROVIDER PAID"]
[{"$f":"+A41+1","v":26},"Lease/Rental-Real Property",null,null,null,null,null,16011]
[{"$f":"+A43+1","v":27},"Leasehold/Leasehold Improvements",null,null,null,null,null,16021]
[{"$f":"+A44+1","v":28},"Depreciation-Building",null,null,null,null,null,16031]
[29,"Depreciation-Building/Land Improvements",null,null,null,null,null,16050]
[30,"Mortgage Interest",null,null,null,null,null,16061]
[31,"Mortgage Expenses",null,null,null,null,null,16071]
[32,"Insurance-Property & Casualty",null,null,null,null,null,16081]
[33,"Real Estate Taxes",null,null,null,null,null,16091]
[34,"Interest on Capital Indebtedness",null,null,null,null,null,16101]
[35,"Other (Detail Required)",null,null,null,null,null,16997]
[36,{"$f":"\"Total Property (Sum Lines \" &$A$43 &\" - \" &A52&\")\"","v":"Total Property (Sum Lines 26 - 35)"},null,null,null,null,null,16996,null,{"$f":"J43+J44+J45+J46+J47+J48+J49+J50+J51+J52","v":0}]
[]
[{"$f":"+A53+1","v":37},"Parent Agency Administration Allocation",null,null,null,null,null,19070]
[{"$f":"+A55+1","v":38},{"$f":"\"Total Agency Administration (Sum Lines \"&$A$14 &\", \" &$A$15 &\", \" & $A$19 &\", \" & $A$33 & \", \" &$A$41 & \", \" & $A$53 &\", \" &$A$55 &\")\"","v":"Total Agency Administration (Sum Lines 1, 2, 5, 18, 25, 36, 37)"},null,null,null,null,null,19090,null,{"$f":"J14+J15+J19+J33+J41+J53+J55","v":0}]
[{"$f":"+A56+1","v":39},"Adjustments/Non-Allowable Costs (Detail Required)",null,null,null,null,null,19031]
[{"$f":"+A57+1","v":40},{"$f":"+\"Net Agency Administration (Line \" &$A$56 &\" minus \" &$A$57 &\")\"","v":"Net Agency Administration (Line 38 minus 39)"},null,null,null,null,null,19998,null,{"$f":"J56-J57","v":0}]
["CALCULATION OF OPERATING COSTS *"]
[{"$f":"+A58+1","v":41},"OCFS Subtotal",null,null,null,null,null,19110]
[{"$f":"+A60+1","v":42},"TBI Subtotal",null,null,null,null,null,19120]
[{"$f":"+A61+1","v":43},"NHTD Subtotal",null,null,null,null,null,19130]
[44,"CAH I & II Subtotal",null,null,null,null,null,19140]
[{"$f":"+A63+1","v":45},"Shared Programs Subtotal",null,null,null,null,null,19160]
[46,"Other Programs Subtotal**",null,null,null,null,null,19170]
[47,"Total Agency Operating Costs",null,null,null,null,null,19180,null,{"$f":"J60+J61+J62+J63+J64+J65","v":0}]
["CALCULATION OF RATIO VALUE FACTOR"]
[{"$f":"+A66+1","v":48},{"$f":"\"Net Agency Administration (CCR-3, Line \"&$A$58&\")\"","v":"Net Agency Administration (CCR-3, Line 40)"},null,null,null,null,null,19999]
[{"$f":"+A68+1","v":49},{"$f":"\"Total Agency Operating Costs (CCR-3, Line \"&$A$66&\")\"","v":"Total Agency Operating Costs (CCR-3, Line 47)"},null,null,null,null,null,19171]
[{"$f":"+A69+1","v":50},{"$f":"\"Ratio Value Factor (Line \" & $A$68 &\" divided by line \" &$A$69 &\")\"","v":"Ratio Value Factor (Line 48 divided by line 49)"},null,null,null,null,null,19190,null,{"$f":"J68/J69","v":{"$error":"#DIV/0!"}}]
["ALLOCATION OF AGENCY ADMINISTRATION USING RATIO VALUE ***"]
[{"$f":"+A70+1","v":51},{"$f":"\"OCFS Allocation (Line \" & $A$60 &\" x line \" &$A$70 &\")\"","v":"OCFS Allocation (Line 41 x line 50)"},null,null,null,null,null,19210]
[{"$f":"+A72+1","v":52},{"$f":"\"TBI Allocation (Line \" & $A$61 &\" x line \" &$A$70 &\")\"","v":"TBI Allocation (Line 42 x line 50)"},null,null,null,null,null,19220]
[{"$f":"+A73+1","v":53},{"$f":"\"NHTD Allocation (Line \" & $A$62 &\" x line \" &$A$70 &\")\"","v":"NHTD Allocation (Line 43 x line 50)"},null,null,null,null,null,19230]
[54,"CAH I & II Allocation (Line 44 x line 51)",null,null,null,null,null,19240]
[{"$f":"+A75+1","v":55},{"$f":"\"Shared Programs Allocation (Line \" & $A$64 &\" x line \" &$A$70 &\")\"","v":"Shared Programs Allocation (Line 45 x line 50)"},null,null,null,null,null,19260]
[56,{"$f":"\"Other Programs Allocation (Line \" & $A$65 &\" x line \" &$A$70 &\")\"","v":"Other Programs Allocation (Line 46 x line 50)"},null,null,null,null,null,19270]
[57,{"$f":"\"Total Agency Administration (Sum lines \"&$A$72&\" - \"&$A$77&\")\"","v":"Total Agency Administration (Sum lines 51 - 56)"},null,null,null,null,null,19280,null,{"$f":"J72+J73+J74+J75+J76+J77","v":0}]
["Calculation of Adjusted Operating Costs (Within State Agency)"]
[{"$f":"+A78+1","v":58},"OCFS Adjusted Subtotal",null,null,null,null,null,19310]
[59,"TBI Adjusted Subtotal",null,null,null,null,null,19320]
[60,"NHTD Adjusted Subtotal",null,null,null,null,null,19330]
[61,"CAH I & II Adjusted Subtotal",null,null,null,null,null,19340]
[{"$f":"+A83+1","v":62},"Shared Programs Adjusted Subtotal",null,null,null,null,null,19360]
["CALCULATION OF ADJUSTED RATIO VALUE FACTOR ****"]
[{"$f":"+A84+1","v":63},{"$f":"\"OCFS (Adjusted) Ratio Value Factor (line \"&$A$72&\" divided by line \"&A60&\")\"","v":"OCFS (Adjusted) Ratio Value Factor (line 51 divided by line 41)"},null,null,null,null,null,19410,"OCFS"]
[{"$f":"+A86+1","v":64},{"$f":"\"TBI (Adjusted) Ratio Value Factor (line \"&$A$73&\" divided by line \"&A61&\")\"","v":"TBI (Adjusted) Ratio Value Factor (line 52 divided by line 42)"},null,null,null,null,null,19420,"TBI"]
[{"$f":"+A87+1","v":65},{"$f":"\"NHTD (Adjusted) Ratio Value Factor (line \"&$A$74&\" divided by line \"&A62&\")\"","v":"NHTD (Adjusted) Ratio Value Factor (line 53 divided by line 43)"},null,null,null,null,null,19430,"NHTD"]
[{"$f":"+A88+1","v":66},{"$f":"\"CAH I & II(Adjusted) Ratio Value Factor (line \" & A75 &\" divided by line \" & A63 &\")\"","v":"CAH I & II(Adjusted) Ratio Value Factor (line 54 divided by line 44)"},null,null,null,null,null,19440,"CAH I & II"]
[{"$f":"+A89+1","v":67},{"$f":"\"Shared Programs (Adjusted) Ratio Value Factor (line \"&$A$76&\" divided by line \"&A64&\")\"","v":"Shared Programs (Adjusted) Ratio Value Factor (line 55 divided by line 45)"},null,null,null,null,null,19460]
[]
["*",{"$f":"\"Totals by State Agency from CCR-1, Line \" & CCR_1!$A$70 & \". Do not report operating costs for programs 0880 and 0890.\"","v":"Totals by State Agency from CCR-1, Line 48. Do not report operating costs for programs 0880 and 0890."}]
["**","This amount must equal the sum of lines 1 through 4 of column 7 on schedule CCR-2. These amounts are not detailed elsewhere in the CCR and, therefore, will not crossfoot to CCR-1."]
[]
["***","For each state agency, the sum of agency administration allocated to each program/site on CCR-1, line 49, must equal the agency administration calculated below."]
[]
["****","The adjusted ratio value factor for each State Agency should appear in the item description column of that State Agency specific CCR-1, line 49."]

{"sheet":"CCR_4","index":4,"n_rows":48,"n_cols":225,"rows_kept":48,"cut":false,"hidden":false,"merged":[[24,41,25,41],[24,40,25,40],[24,39,25,39],[24,26,25,26],[24,25,25,25],[24,24,25,24],[24,23,25,23],[24,22,25,22],[24,21,25,21],[24,36,25,36],[24,37,25,37],[24,38,25,38],[24,50,25,50],[24,49,25,49],[24,48,25,48],[24,47,25,47],[24,46,25,46],[24,45,25,45],[24,44,25,44],[24,43,25,43],[24,42,25,42],[24,71,25,71],[24,70,25,70],[24,69,25,69],[24,68,25,68],[24,67,25,67],[24,66,25,66],[24,65,25,65],[24,64,25,64],[24,63,25,63],[24,143,25,143],[24,142,25,142],[24,141,25,141],[24,140,25,140],[24,139,25,139],[24,138,25,138],[24,74,25,74],[24,73,25,73],[24,72,25,72],[24,137,25,137],[24,132,25,132],[24,133,25,133],[24,134,25,134],[24,135,25,135],[24,136,25,136],[24,108,25,108],[24,109,25,109],[24,110,25,110],[24,111,25,111],[24,112,25,112],[24,94,25,94],[24,95,25,95],[24,89,25,89],[24,90,25,90],[24,152,25,152],[24,151,25,151],[24,150,25,150],[24,149,25,149],[24,148,25,148],[24,147,25,147],[24,146,25,146],[24,145,25,145],[24,144,25,144],[24,161,25,161],[24,160,25,160],[24,159,25,159],[24,158,25,158],[24,157,25,157],[24,156,25,156],[24,155,25,155],[24,154,25,154],[24,153,25,153],[24,170,25,170],[24,169,25,169],[24,168,25,168],[24,167,25,167],[24,166,25,166],[24,165,25,165],[24,164,25,164],[24,163,25,163],[24,162,25,162],[24,179,25,179],[24,178,25,178],[24,177,25,177],[24,176,25,176],[24,175,25,175],[24,174,25,174],[24,173,25,173],[24,172,25,172],[24,171,25,171],[24,188,25,188],[24,187,25,187],[24,186,25,186],[24,185,25,185],[24,184,25,184],[24,183,25,183],[24,182,25,182],[24,181,25,181],[24,180,25,180],[24,197,25,197],[24,196,25,196],[24,195,25,195],[24,194,25,194],[24,193,25,193],[24,192,25,192],[24,191,25,191],[24,190,25,190],[24,189,25,189],[24,206,25,206],[24,205,25,205],[24,204,25,204],[24,203,25,203],[24,202,25,202],[24,201,25,201],[24,200,25,200],[24,199,25,199],[24,198,25,198],[24,215,25,215],[24,214,25,214],[24,213,25,213],[24,212,25,212],[24,211,25,211],[24,210,25,210],[24,209,25,209],[24,208,25,208],[24,207,25,207],[24,224,25,224],[24,223,25,223],[24,222,25,222],[24,221,25,221],[24,220,25,220],[24,219,25,219],[24,218,25,218],[24,217,25,217],[24,216,25,216],[16,222,16,224],[17,222,17,224],[18,222,18,224],[19,222,19,224],[20,222,20,224],[21,222,21,224],[22,222,22,224],[16,219,16,221],[17,219,17,221],[18,219,18,221],[19,219,19,221],[20,219,20,221],[21,219,21,221],[22,219,22,221],[16,216,16,218],[17,216,17,218],[18,216,18,218],[19,216,19,218],[20,216,20,218],[21,216,21,218],[22,216,22,218],[16,213,16,215],[17,213,17,215],[18,213,18,215],[19,213,19,215],[20,213,20,215],[21,213,21,215],[22,213,22,215],[16,210,16,212],[17,210,17,212],[18,210,18,212],[19,210,19,212],[20,210,20,212],[21,210,21,212],[22,210,22,212],[16,207,16,209],[17,207,17,209],[18,207,18,209],[19,207,19,209],[20,207,20,209],[21,207,21,209],[22,207,22,209],[16,204,16,206],[17,204,17,206],[18,204,18,206],[19,204,19,206],[20,204,20,206],[21,204,21,206],[22,204,22,206],[16,201,16,203],[17,201,17,203],[18,201,18,203],[19,201,19,203],[20,201,20,203],[21,201,21,203],[22,201,22,203],[16,198,16,200],[17,198,17,200],[18,198,18,200],[19,198,19,200],[20,198,20,200],[21,198,21,200],[22,198,22,200],[16,195,16,197],[17,195,17,197],[18,195,18,197],[19,195,19,197],[20,195,20,197],[21,195,21,197],[22,195,22,197],[22,180,22,182],[22,183,22,185],[22,186,22,188],[22,189,22,191],[22,192,22,194],[20,180,20,182],[20,183,20,185],[20,186,20,188],[20,189,20,191],[20,192,20,194],[21,180,21,182],[21,183,21,185],[21,186,21,188],[21,189,21,191],[21,192,21,194],[18,180,18,182],[18,183,18,185],[18,186,18,188],[18,189,18,191],[18,192,18,194],[19,180,19,182],[19,183,19,185],[19,186,19,188],[19,189,19,191],[19,192,19,194],[16,180,16,182],[16,183,16,185],[16,186,16,188],[16,189,16,191],[16,192,16,194],[17,180,17,182],[17,183,17,185],[17,186,17,188],[17,189,17,191],[17,192,17,194],[22,165,22,167],[22,168,22,170],[22,171,22,173],[22,174,22,176],[22,177,22,179],[20,165,20,167],[20,168,20,170],[20,171,20,173],[20,174,20,176],[20,177,20,179],[21,165,21,167],[21,168,21,170],[21,171,21,173],[21,174,21,176],[21,177,21,179],[18,165,18,167],[18,168,18,170],[18,171,18,173],[18,174,18,176],[18,177,18,179],[19,165,19,167],[19,168,19,170],[19,171,19,173],[19,174,19,176],[19,177,19,179],[16,165,16,167],[16,168,16,170],[16,171,16,173],[16,174,16,176],[16,177,16,179],[17,165,17,167],[17,168,17,170],[17,171,17,173],[17,174,17,176],[17,177,17,179],[22,150,22,152],[22,153,22,155],[22,156,22,158],[22,159,22,161],[22,162,22,164],[20,150,20,152],[20,153,20,155],[20,156,20,158],[20,159,20,161],[20,162,20,164],[21,150,21,152],[21,153,21,155],[21,156,21,158],[21,159,21,161],[21,162,21,164],[18,150,18,152],[18,153,18,155],[18,156,18,158],[18,159,18,161],[18,162,18,164],[19,150,19,152],[19,153,19,155],[19,156,19,158],[19,159,19,161],[19,162,19,164],[16,150,16,152],[16,153,16,155],[16,156,16,158],[16,159,16,161],[16,162,16,164],[17,150,17,152],[17,153,17,155],[17,156,17,158],[17,159,17,161],[17,162,17,164],[16,147,16,149],[17,147,17,149],[18,147,18,149],[19,147,19,149],[20,147,20,149],[21,147,21,149],[22,147,22,149],[16,144,16,146],[17,144,17,146],[18,144,18,146],[19,144,19,146],[20,144,20,146],[21,144,21,146],[22,144,22,146],[16,141,16,143],[17,141,17,143],[18,141,18,143],[19,141,19,143],[20,141,20,143],[21,141,21,143],[22,141,22,143],[16,138,16,140],[17,138,17,140],[18,138,18,140],[19,138,19,140],[20,138,20,140],[21,138,21,140],[22,138,22,140],[22,135,22,137],[24,117,25,117],[24,118,25,118],[24,119,25,119],[24,120,25,120],[24,121,25,121],[24,122,25,122],[24,123,25,123],[24,124,25,124],[24,125,25,125],[24,126,25,126],[24,127,25,127],[24,128,25,128],[24,129,25,129],[24,130,25,130],[24,131,25,131],[22,120,22,122],[22,123,22,125],[22,126,22,128],[22,129,22,131],[22,132,22,134],[22,117,22,119],[20,135,20,137],[21,117,21,119],[21,120,21,122],[21,123,21,125],[21,126,21,128],[21,129,21,131],[21,132,21,134],[21,135,21,137],[20,120,20,122],[20,123,20,125],[20,126,20,128],[20,129,20,131],[20,132,20,134],[20,117,20,119],[18,135,18,137],[19,117,19,119],[19,120,19,122],[19,123,19,125],[19,126,19,128],[19,129,19,131],[19,132,19,134],[19,135,19,137],[18,120,18,122],[18,123,18,125],[18,126,18,128],[18,129,18,131],[18,132,18,134],[18,117,18,119],[16,135,16,137],[17,117,17,119],[17,120,17,122],[17,123,17,125],[17,126,17,128],[17,129,17,131],[17,132,17,134],[17,135,17,137],[16,120,16,122],[16,123,16,125],[16,126,16,128],[16,129,16,131],[16,132,16,134],[16,117,16,119],[22,105,22,107],[22,108,22,110],[22,111,22,113],[22,114,22,116],[24,105,25,105],[24,106,25,106],[24,107,25,107],[24,113,25,113],[24,114,25,114],[24,115,25,115],[24,116,25,116],[20,105,20,107],[20,108,20,110],[20,111,20,113],[20,114,20,116],[21,96,21,98],[21,99,21,101],[21,102,21,104],[21,105,21,107],[21,108,21,110],[21,111,21,113],[21,114,21,116],[20,96,20,98],[20,99,20,101],[20,102,20,104],[18,105,18,107],[18,108,18,110],[18,111,18,113],[18,114,18,116],[19,96,19,98],[19,99,19,101],[19,102,19,104],[19,105,19,107],[19,108,19,110],[19,111,19,113],[19,114,19,116],[18,96,18,98],[18,99,18,101],[18,102,18,104],[16,105,16,107],[16,108,16,110],[16,111,16,113],[16,114,16,116],[17,96,17,98],[17,99,17,101],[17,102,17,104],[17,105,17,107],[17,108,17,110],[17,111,17,113],[17,114,17,116],[16,96,16,98],[16,99,16,101],[16,102,16,104],[22,96,22,98],[22,99,22,101],[22,102,22,104],[24,96,25,96],[24,97,25,97],[24,98,25,98],[24,99,25,99],[24,100,25,100],[24,101,25,101],[24,102,25,102],[24,103,25,103],[24,104,25,104],[24,91,25,91],[24,92,25,92],[24,93,25,93],[22,90,22,92],[22,93,22,95],[24,75,25,75],[24,76,25,76],[24,77,25,77],[24,78,25,78],[24,79,25,79],[24,80,25,80],[24,81,25,81],[24,82,25,82],[24,83,25,83],[24,84,25,84],[24,85,25,85],[24,86,25,86],[24,87,25,87],[24,88,25,88],[22,75,22,77],[22,78,22,80],[22,81,22,83],[22,84,22,86],[22,87,22,89],[20,90,20,92],[20,93,20,95],[21,75,21,77],[21,78,21,80],[21,81,21,83],[21,84,21,86],[21,87,21,89],[21,90,21,92],[21,93,21,95],[20,75,20,77],[20,78,20,80],[20,81,20,83],[20,84,20,86],[20,87,20,89],[18,90,18,92],[18,93,18,95],[19,75,19,77],[19,78,19,80],[19,81,19,83],[19,84,19,86],[19,87,19,89],[19,90,19,92],[19,93,19,95],[18,75,18,77],[18,78,18,80],[18,81,18,83],[18,84,18,86],[18,87,18,89],[16,90,16,92],[16,93,16,95],[17,75,17,77],[17,78,17,80],[17,81,17,83],[17,84,17,86],[17,87,17,89],[17,90,17,92],[17,93,17,95],[16,75,16,77],[16,78,16,80],[16,81,16,83],[16,84,16,86],[16,87,16,89],[22,63,22,65],[22,66,22,68],[22,69,22,71],[22,72,22,74],[20,63,20,65],[20,66,20,68],[20,69,20,71],[20,72,20,74],[21,63,21,65],[21,66,21,68],[21,69,21,71],[21,72,21,74],[18,63,18,65],[18,66,18,68],[18,69,18,71],[18,72,18,74],[19,63,19,65],[19,66,19,68],[19,69,19,71],[19,72,19,74],[16,63,16,65],[16,66,16,68],[16,69,16,71],[16,72,16,74],[17,63,17,65],[17,66,17,68],[17,69,17,71],[17,72,17,74],[22,51,22,53],[22,54,22,56],[22,57,22,59],[22,60,22,62],[18,51,18,53],[18,54,18,56],[18,57,18,59],[18,60,18,62],[19,51,19,53],[19,54,19,56],[19,57,19,59],[19,60,19,62],[16,51,16,53],[16,54,16,56],[16,57,16,59],[16,60,16,62],[24,60,25,60],[24,61,25,61],[24,62,25,62],[20,51,20,53],[20,54,20,56],[20,57,20,59],[20,60,20,62],[21,51,21,53],[21,54,21,56],[21,57,21,59],[21,60,21,62],[24,51,25,51],[24,52,25,52],[24,53,25,53],[24,54,25,54],[24,55,25,55],[24,56,25,56],[24,57,25,57],[24,58,25,58],[24,59,25,59],[17,51,17,53],[17,54,17,56],[17,57,17,59],[17,60,17,62],[22,39,22,41],[22,42,22,44],[22,45,22,47],[22,48,22,50],[20,39,20,41],[20,42,20,44],[20,45,20,47],[20,48,20,50],[21,39,21,41],[21,42,21,44],[21,45,21,47],[21,48,21,50],[18,39,18,41],[18,42,18,44],[18,45,18,47],[18,48,18,50],[19,39,19,41],[19,42,19,44],[19,45,19,47],[19,48,19,50],[18,27,18,29],[18,30,18,32],[18,33,18,35],[18,36,18,38],[19,27,19,29],[19,30,19,32],[19,33,19,35],[19,36,19,38],[16,27,16,29],[16,30,16,32],[16,33,16,35],[16,36,16,38],[17,27,17,29],[16,39,16,41],[16,42,16,44],[16,45,16,47],[16,48,16,50],[17,39,17,41],[17,42,17,44],[17,45,17,47],[17,48,17,50],[17,30,17,32],[17,33,17,35],[17,36,17,38],[20,27,20,29],[20,30,20,32],[20,33,20,35],[20,36,20,38],[21,27,21,29],[21,30,21,32],[21,33,21,35],[21,36,21,38],[24,27,25,27],[24,28,25,28],[24,29,25,29],[24,30,25,30],[24,31,25,31],[24,32,25,32],[24,33,25,33],[24,34,25,34],[24,35,25,35],[22,27,22,29],[22,30,22,32],[22,33,22,35],[22,36,22,38],[16,24,16,26],[17,24,17,26],[18,24,18,26],[19,24,19,26],[20,24,20,26],[21,21,21,23],[22,21,22,23],[16,21,16,23],[17,21,17,23],[18,21,18,23],[19,21,19,23],[20,21,20,23],[21,24,21,26],[22,24,22,26],[16,12,16,14],[18,12,18,14],[19,12,19,14],[20,12,20,14],[24,17,25,17],[24,1,25,3],[43,1,43,3],[44,1,44,3],[16,18,16,20],[17,18,17,20],[18,18,18,20],[19,18,19,20],[20,18,20,20],[21,18,21,20],[22,18,22,20],[24,18,25,18],[24,19,25,19],[24,20,25,20],[38,1,38,3],[39,1,39,3],[40,1,40,3],[41,1,41,3],[42,1,42,3],[33,1,33,3],[24,16,25,16],[16,0,25,0],[24,15,25,15],[4,9,4,13],[5,9,5,13],[7,0,7,1],[7,2,7,5],[8,0,8,1],[9,0,9,1],[14,13,14,14],[15,13,15,14],[24,13,25,13],[24,14,25,14],[24,12,25,12],[21,12,21,14],[22,12,22,14],[16,15,16,17],[18,15,18,17],[19,15,19,17],[20,15,20,17],[21,15,21,17],[22,15,22,17],[17,12,17,14],[17,15,17,17],[26,1,26,3],[27,1,27,3],[3,2,3,3],[4,2,4,7],[5,2,5,7],[45,0,45,6],[30,1,30,3],[31,1,31,3],[32,1,32,3],[37,1,37,3],[28,1,28,3],[29,1,29,3],[3,4,3,5],[3,6,3,7],[24,4,24,10],[34,1,34,3],[35,1,35,3],[36,1,36,3],[6,6,6,7],[3,0,3,1],[4,0,4,1],[6,0,6,5]]}
[{"$f":"COLUMN()","v":1},{"$f":"COLUMN()","v":2},{"$f":"COLUMN()","v":3},{"$f":"COLUMN()","v":4},{"$f":"COLUMN()","v":5},{"$f":"COLUMN()","v":6},{"$f":"COLUMN()","v":7},{"$f":"COLUMN()","v":8},{"$f":"COLUMN()","v":9},{"$f":"COLUMN()","v":10},{"$f":"COLUMN()","v":11},{"$f":"COLUMN()","v":12},{"$f":"COLUMN()","v":13},{"$f":"COLUMN()","v":14},{"$f":"COLUMN()","v":15},{"$f":"COLUMN()","v":16},{"$f":"COLUMN()","v":17},{"$f":"COLUMN()","v":18},{"$f":"COLUMN()","v":19},{"$f":"COLUMN()","v":20},{"$f":"COLUMN()","v":21},{"$f":"COLUMN()","v":22},{"$f":"COLUMN()","v":23},{"$f":"COLUMN()","v":24},{"$f":"COLUMN()","v":25},{"$f":"COLUMN()","v":26},{"$f":"COLUMN()","v":27},{"$f":"COLUMN()","v":28},{"$f":"COLUMN()","v":29},{"$f":"COLUMN()","v":30},{"$f":"COLUMN()","v":31},{"$f":"COLUMN()","v":32},{"$f":"COLUMN()","v":33},{"$f":"COLUMN()","v":34},{"$f":"COLUMN()","v":35},{"$f":"COLUMN()","v":36},{"$f":"COLUMN()","v":37},{"$f":"COLUMN()","v":38},{"$f":"COLUMN()","v":39},{"$f":"COLUMN()","v":40},{"$f":"COLUMN()","v":41},{"$f":"COLUMN()","v":42},{"$f":"COLUMN()","v":43},{"$f":"COLUMN()","v":44},{"$f":"COLUMN()","v":45},{"$f":"COLUMN()","v":46},{"$f":"COLUMN()","v":47},{"$f":"COLUMN()","v":48},{"$f":"COLUMN()","v":49},{"$f":"COLUMN()","v":50},{"$f":"COLUMN()","v":51},{"$f":"COLUMN()","v":52},{"$f":"COLUMN()","v":53},{"$f":"COLUMN()","v":54},{"$f":"COLUMN()","v":55},{"$f":"COLUMN()","v":56},{"$f":"COLUMN()","v":57},{"$f":"COLUMN()","v":58},{"$f":"COLUMN()","v":59},{"$f":"COLUMN()","v":60},{"$f":"COLUMN()","v":61},{"$f":"COLUMN()","v":62},{"$f":"COLUMN()","v":63},{"$f":"COLUMN()","v":64},{"$f":"COLUMN()","v":65},{"$f":"COLUMN()","v":66},{"$f":"COLUMN()","v":67},{"$f":"COLUMN()","v":68},{"$f":"COLUMN()","v":69},{"$f":"COLUMN()","v":70},{"$f":"COLUMN()","v":71},{"$f":"COLUMN()","v":72},{"$f":"COLUMN()","v":73},{"$f":"COLUMN()","v":74},{"$f":"COLUMN()","v":75},{"$f":"COLUMN()","v":76},{"$f":"COLUMN()","v":77},{"$f":"COLUMN()","v":78},{"$f":"COLUMN()","v":79},{"$f":"COLUMN()","v":80},{"$f":"COLUMN()","v":81},{"$f":"COLUMN()","v":82},{"$f":"COLUMN()","v":83},{"$f":"COLUMN()","v":84},{"$f":"COLUMN()","v":85},{"$f":"COLUMN()","v":86},{"$f":"COLUMN()","v":87},{"$f":"COLUMN()","v":88},{"$f":"COLUMN()","v":89},{"$f":"COLUMN()","v":90},{"$f":"COLUMN()","v":91},{"$f":"COLUMN()","v":92},{"$f":"COLUMN()","v":93},{"$f":"COLUMN()","v":94},{"$f":"COLUMN()","v":95},{"$f":"COLUMN()","v":96},{"$f":"COLUMN()","v":97},{"$f":"COLUMN()","v":98},{"$f":"COLUMN()","v":99},{"$f":"COLUMN()","v":100},{"$f":"COLUMN()","v":101},{"$f":"COLUMN()","v":102},{"$f":"COLUMN()","v":103},{"$f":"COLUMN()","v":104},{"$f":"COLUMN()","v":105},{"$f":"COLUMN()","v":106},{"$f":"COLUMN()","v":107},{"$f":"COLUMN()","v":108},{"$f":"COLUMN()","v":109},{"$f":"COLUMN()","v":110},{"$f":"COLUMN()","v":111},{"$f":"COLUMN()","v":112},{"$f":"COLUMN()","v":113},{"$f":"COLUMN()","v":114},{"$f":"COLUMN()","v":115},{"$f":"COLUMN()","v":116},{"$f":"COLUMN()","v":117},{"$f":"COLUMN()","v":118},{"$f":"COLUMN()","v":119},{"$f":"COLUMN()","v":120},{"$f":"COLUMN()","v":121},{"$f":"COLUMN()","v":122},{"$f":"COLUMN()","v":123},{"$f":"COLUMN()","v":124},{"$f":"COLUMN()","v":125},{"$f":"COLUMN()","v":126},{"$f":"COLUMN()","v":127},{"$f":"COLUMN()","v":128},{"$f":"COLUMN()","v":129},{"$f":"COLUMN()","v":130},{"$f":"COLUMN()","v":131},{"$f":"COLUMN()","v":132},{"$f":"COLUMN()","v":133},{"$f":"COLUMN()","v":134},{"$f":"COLUMN()","v":135},{"$f":"COLUMN()","v":136},{"$f":"COLUMN()","v":137},{"$f":"COLUMN()","v":138},{"$f":"COLUMN()","v":139},{"$f":"COLUMN()","v":140},{"$f":"COLUMN()","v":141},{"$f":"COLUMN()","v":142},{"$f":"COLUMN()","v":143},{"$f":"COLUMN()","v":144},{"$f":"COLUMN()","v":145},{"$f":"COLUMN()","v":146},{"$f":"COLUMN()","v":147},{"$f":"COLUMN()","v":148},{"$f":"COLUMN()","v":149},{"$f":"COLUMN()","v":150},{"$f":"COLUMN()","v":151},{"$f":"COLUMN()","v":152},{"$f":"COLUMN()","v":153},{"$f":"COLUMN()","v":154},{"$f":"COLUMN()","v":155},{"$f":"COLUMN()","v":156},{"$f":"COLUMN()","v":157},{"$f":"COLUMN()","v":158},{"$f":"COLUMN()","v":159},{"$f":"COLUMN()","v":160},{"$f":"COLUMN()","v":161},{"$f":"COLUMN()","v":162},{"$f":"COLUMN()","v":163},{"$f":"COLUMN()","v":164},{"$f":"COLUMN()","v":165},{"$f":"COLUMN()","v":166},{"$f":"COLUMN()","v":167},{"$f":"COLUMN()","v":168},{"$f":"COLUMN()","v":169},{"$f":"COLUMN()","v":170},{"$f":"COLUMN()","v":171},{"$f":"COLUMN()","v":172},{"$f":"COLUMN()","v":173},{"$f":"COLUMN()","v":174},{"$f":"COLUMN()","v":175},{"$f":"COLUMN()","v":176},{"$f":"COLUMN()","v":177},{"$f":"COLUMN()","v":178},{"$f":"COLUMN()","v":179},{"$f":"COLUMN()","v":180},{"$f":"COLUMN()","v":181},{"$f":"COLUMN()","v":182},{"$f":"COLUMN()","v":183},{"$f":"COLUMN()","v":184},{"$f":"COLUMN()","v":185},{"$f":"COLUMN()","v":186},{"$f":"COLUMN()","v":187},{"$f":"COLUMN()","v":188},{"$f":"COLUMN()","v":189},{"$f":"COLUMN()","v":190},{"$f":"COLUMN()","v":191},{"$f":"COLUMN()","v":192},{"$f":"COLUMN()","v":193},{"$f":"COLUMN()","v":194},{"$f":"COLUMN()","v":195},{"$f":"COLUMN()","v":196},{"$f":"COLUMN()","v":197},{"$f":"COLUMN()","v":198},{"$f":"COLUMN()","v":199},{"$f":"COLUMN()","v":200},{"$f":"COLUMN()","v":201},{"$f":"COLUMN()","v":202},{"$f":"COLUMN()","v":203},{"$f":"COLUMN()","v":204},{"$f":"COLUMN()","v":205},{"$f":"COLUMN()","v":206},{"$f":"COLUMN()","v":207},{"$f":"COLUMN()","v":208},{"$f":"COLUMN()","v":209},{"$f":"COLUMN()","v":210},{"$f":"COLUMN()","v":211},{"$f":"COLUMN()","v":212},{"$f":"COLUMN()","v":213},{"$f":"COLUMN()","v":214},{"$f":"COLUMN()","v":215},{"$f":"COLUMN()","v":216},{"$f":"COLUMN()","v":217},{"$f":"COLUMN()","v":218},{"$f":"COLUMN()","v":219},{"$f":"COLUMN()","v":220},{"$f":"COLUMN()","v":221},{"$f":"COLUMN()","v":222},{"$f":"COLUMN()","v":223},{"$f":"COLUMN()","v":224},{"$f":"COLUMN()","v":225}]
[3,null,null,null,null,null,null,null,null,null,null,null,{"$f":"IFERROR(VLOOKUP(INT((M$1-10)/3)&\".YC\",CCR_0!$P:$Q,2,0),\"\")","v":""},{"$f":"IFERROR(VLOOKUP(INT((N$1-10)/3)&\".YC\",CCR_0!$P:$Q,2,0),\"\")","v":""},{"$f":"IFERROR(VLOOKUP(INT((O$1-10)/3)&\".YC\",CCR_0!$P:$Q,2,0),\"\")","v":""},{"$f":"IFERROR(VLOOKUP(INT((P$1-10)/3)&\".YC\",CCR_0!$P:$Q,2,0),\"\")","v":""},{"$f":"IFERROR(VLOOKUP(INT((Q$1-10)/3)&\".YC\",CCR_0!$P:$Q,2,0),\"\")","v":""},{"$f":"IFERROR(VLOOKUP(INT((R$1-10)/3)&\".YC\",CCR_0!$P:$Q,2,0),\"\")","v":""},{"$f":"IFERROR(VLOOKUP(INT((S$1-10)/3)&\".YC\",CCR_0!$P:$Q,2,0),\"\")","v":""},{"$f":"IFERROR(VLOOKUP(INT((T$1-10)/3)&\".YC\",CCR_0!$P:$Q,2,0),\"\")","v":""},{"$f":"IFERROR(VLOOKUP(INT((U$1-10)/3)&\".YC\",CCR_0!$P:$Q,2,0),\"\")","v":""},{"$f":"IFERROR(VLOOKUP(INT((V$1-10)/3)&\".YC\",CCR_0!$P:$Q,2,0),\"\")","v":""},{"$f":"IFERROR(VLOOKUP(INT((W$1-10)/3)&\".YC\",CCR_0!$P:$Q,2,0),\"\")","v":""},{"$f":"IFERROR(VLOOKUP(INT((X$1-10)/3)&\".YC\",CCR_0!$P:$Q,2,0),\"\")","v":""},{"$f":"IFERROR(VLOOKUP(INT((Y$1-10)/3)&\".YC\",CCR_0!$P:$Q,2,0),\"\")","v":""},{"$f":"IFERROR(VLOOKUP(INT((Z$1-10)/3)&\".YC\",CCR_0!$P:$Q,2,0),\"\")","v":""},{"$f":"IFERROR(VLOOKUP(INT((AA$1-10)/3)&\".YC\",CCR_0!$P:$Q,2,0),\"\")","v":""},{"$f":"IFERROR(VLOOKUP(INT((AB$1-10)/3)&\".YC\",CCR_0!$P:$Q,2,0),\"\")","v":""},{"$f":"IFERROR(VLOOKUP(INT((AC$1-10)/3)&\".YC\",CCR_0!$P:$Q,2,0),\"\")","v":""},{"$f":"IFERROR(VLOOKUP(INT((AD$1-10)/3)&\".YC\",CCR_0!$P:$Q,2,0),\"\")","v":""},{"$f":"IFERROR(VLOOKUP(INT((AE$1-10)/3)&\".YC\",CCR_0!$P:$Q,2,0),\"\")","v":""},{"$f":"IFERROR(VLOOKUP(INT((AF$1-10)/3)&\".YC\",CCR_0!$P:$Q,2,0),\"\")","v":""},{"$f":"IFERROR(VLOOKUP(INT((AG$1-10)/3)&\".YC\",CCR_0!$P:$Q,2,0),\"\")","v":""},{"$f":"IFERROR(VLOOKUP(INT((AH$1-10)/3)&\".YC\",CCR_0!$P:$Q,2,0),\"\")","v":""},{"$f":"IFERROR(VLOOKUP(INT((AI$1-10)/3)&\".YC\",CCR_0!$P:$Q,2,0),\"\")","v":""},{"$f":"IFERROR(VLOOKUP(INT((AJ$1-10)/3)&\".YC\",CCR_0!$P:$Q,2,0),\"\")","v":""},{"$f":"IFERROR(VLOOKUP(INT((AK$1-10)/3)&\".YC\",CCR_0!$P:$Q,2,0),\"\")","v":""},{"$f":"IFERROR(VLOOKUP(INT((AL$1-10)/3)&\".YC\",CCR_0!$P:$Q,2,0),\"\")","v":""},{"$f":"IFERROR(VLOOKUP(INT((AM$1-10)/3)&\".YC\",CCR_0!$P:$Q,2,0),\"\")","v":""},{"$f":"IFERROR(VLOOKUP(INT((AN$1-10)/3)&\".YC\",CCR_0!$P:$Q,2,0),\"\")","v":""},{"$f":"IFERROR(VLOOKUP(INT((AO$1-10)/3)&\".YC\",CCR_0!$P:$Q,2,0),\"\")","v":""},{"$f":"IFERROR(VLOOKUP(INT((AP$1-10)/3)&\".YC\",CCR_0!$P:$Q,2,0),\"\")","v":""},{"$f":"IFERROR(VLOOKUP(INT((AQ$1-10)/3)&\".YC\",CCR_0!$P:$Q,2,0),\"\")","v":""},{"$f":"IFERROR(VLOOKUP(INT((AR$1-10)/3)&\".YC\",CCR_0!$P:$Q,2,0),\"\")","v":""},{"$f":"IFERROR(VLOOKUP(INT((AS$1-10)/3)&\".YC\",CCR_0!$P:$Q,2,0),\"\")","v":""},{"$f":"IFERROR(VLOOKUP(INT((AT$1-10)/3)&\".YC\",CCR_0!$P:$Q,2,0),\"\")","v":""},{"$f":"IFERROR(VLOOKUP(INT((AU$1-10)/3)&\".YC\",CCR_0!$P:$Q,2,0),\"\")","v":""},{"$f":"IFERROR(VLOOKUP(INT((AV$1-10)/3)&\".YC\",CCR_0!$P:$Q,2,0),\"\")","v":""},{"$f":"IFERROR(VLOOKUP(INT((AW$1-10)/3)&\".YC\",CCR_0!$P:$Q,2,0),\"\")","v":""},{"$f":"IFERROR(VLOOKUP(INT((AX$1-10)/3)&\".YC\",CCR_0!$P:$Q,2,0),\"\")","v":""},{"$f":"IFERROR(VLOOKUP(INT((AY$1-10)/3)&\".YC\",CCR_0!$P:$Q,2,0),\"\")","v":""},{"$f":"IFERROR(VLOOKUP(INT((AZ$1-10)/3)&\".YC\",CCR_0!$P:$Q,2,0),\"\")","v":""},{"$f":"IFERROR(VLOOKUP(INT((BA$1-10)/3)&\".YC\",CCR_0!$P:$Q,2,0),\"\")","v":""},{"$f":"IFERROR(VLOOKUP(INT((BB$1-10)/3)&\".YC\",CCR_0!$P:$Q,2,0),\"\")","v":""},{"$f":"IFERROR(VLOOKUP(INT((BC$1-10)/3)&\".YC\",CCR_0!$P:$Q,2,0),\"\")","v":""},{"$f":"IFERROR(VLOOKUP(INT((BD$1-10)/3)&\".YC\",CCR_0!$P:$Q,2,0),\"\")","v":""},{"$f":"IFERROR(VLOOKUP(INT((BE$1-10)/3)&\".YC\",CCR_0!$P:$Q,2,0),\"\")","v":""},{"$f":"IFERROR(VLOOKUP(INT((BF$1-10)/3)&\".YC\",CCR_0!$P:$Q,2,0),\"\")","v":""},{"$f":"IFERROR(VLOOKUP(INT((BG$1-10)/3)&\".YC\",CCR_0!$P:$Q,2,0),\"\")","v":""},{"$f":"IFERROR(VLOOKUP(INT((BH$1-10)/3)&\".YC\",CCR_0!$P:$Q,2,0),\"\")","v":""},{"$f":"IFERROR(VLOOKUP(INT((BI$1-10)/3)&\".YC\",CCR_0!$P:$Q,2,0),\"\")","v":""},{"$f":"IFERROR(VLOOKUP(INT((BJ$1-10)/3)&\".YC\",CCR_0!$P:$Q,2,0),\"\")","v":""},{"$f":"IFERROR(VLOOKUP(INT((BK$1-10)/3)&\".YC\",CCR_0!$P:$Q,2,0),\"\")","v":""},{"$f":"IFERROR(VLOOKUP(INT((BL$1-10)/3)&\".YC\",CCR_0!$P:$Q,2,0),\"\")","v":""},{"$f":"IFERROR(VLOOKUP(INT((BM$1-10)/3)&\".YC\",CCR_0!$P:$Q,2,0),\"\")","v":""},{"$f":"IFERROR(VLOOKUP(INT((BN$1-10)/3)&\".YC\",CCR_0!$P:$Q,2,0),\"\")","v":""},{"$f":"IFERROR(VLOOKUP(INT((BO$1-10)/3)&\".YC\",CCR_0!$P:$Q,2,0),\"\")","v":""},{"$f":"IFERROR(VLOOKUP(INT((BP$1-10)/3)&\".YC\",CCR_0!$P:$Q,2,0),\"\")","v":""},{"$f":"IFERROR(VLOOKUP(INT((BQ$1-10)/3)&\".YC\",CCR_0!$P:$Q,2,0),\"\")","v":""},{"$f":"IFERROR(VLOOKUP(INT((BR$1-10)/3)&\".YC\",CCR_0!$P:$Q,2,0),\"\")","v":""},{"$f":"IFERROR(VLOOKUP(INT((BS$1-10)/3)&\".YC\",CCR_0!$P:$Q,2,0),\"\")","v":""},{"$f":"IFERROR(VLOOKUP(INT((BT$1-10)/3)&\".YC\",CCR_0!$P:$Q,2,0),\"\")","v":""},{"$f":"IFERROR(VLOOKUP(INT((BU$1-10)/3)&\".YC\",CCR_0!$P:$Q,2,0),\"\")","v":""},{"$f":"IFERROR(VLOOKUP(INT((BV$1-10)/3)&\".YC\",CCR_0!$P:$Q,2,0),\"\")","v":""},{"$f":"IFERROR(VLOOKUP(INT((BW$1-10)/3)&\".YC\",CCR_0!$P:$Q,2,0),\"\")","v":""},{"$f":"IFERROR(VLOOKUP(INT((BX$1-10)/3)&\".YC\",CCR_0!$P:$Q,2,0),\"\")","v":""},{"$f":"IFERROR(VLOOKUP(INT((BY$1-10)/3)&\".YC\",CCR_0!$P:$Q,2,0),\"\")","v":""},{"$f":"IFERROR(VLOOKUP(INT((BZ$1-10)/3)&\".YC\",CCR_0!$P:$Q,2,0),\"\")","v":""},{"$f":"IFERROR(VLOOKUP(INT((CA$1-10)/3)&\".YC\",CCR_0!$P:$Q,2,0),\"\")","v":""},{"$f":"IFERROR(VLOOKUP(INT((CB$1-10)/3)&\".YC\",CCR_0!$P:$Q,2,0),\"\")","v":""},{"$f":"IFERROR(VLOOKUP(INT((CC$1-10)/3)&\".YC\",CCR_0!$P:$Q,2,0),\"\")","v":""},{"$f":"IFERROR(VLOOKUP(INT((CD$1-10)/3)&\".YC\",CCR_0!$P:$Q,2,0),\"\")","v":""},{"$f":"IFERROR(VLOOKUP(INT((CE$1-10)/3)&\".YC\",CCR_0!$P:$Q,2,0),\"\")","v":""},{"$f":"IFERROR(VLOOKUP(INT((CF$1-10)/3)&\".YC\",CCR_0!$P:$Q,2,0),\"\")","v":""},{"$f":"IFERROR(VLOOKUP(INT((CG$1-10)/3)&\".YC\",CCR_0!$P:$Q,2,0),\"\")","v":""},{"$f":"IFERROR(VLOOKUP(INT((CH$1-10)/3)&\".YC\",CCR_0!$P:$Q,2,0),\"\")","v":""},{"$f":"IFERROR(VLOOKUP(INT((CI$1-10)/3)&\".YC\",CCR_0!$P:$Q,2,0),\"\")","v":""},{"$f":"IFERROR(VLOOKUP(INT((CJ$1-10)/3)&\".YC\",CCR_0!$P:$Q,2,0),\"\")","v":""},{"$f":"IFERROR(VLOOKUP(INT((CK$1-10)/3)&\".YC\",CCR_0!$P:$Q,2,0),\"\")","v":""},{"$f":"IFERROR(VLOOKUP(INT((CL$1-10)/3)&\".YC\",CCR_0!$P:$Q,2,0),\"\")","v":""},{"$f":"IFERROR(VLOOKUP(INT((CM$1-10)/3)&\".YC\",CCR_0!$P:$Q,2,0),\"\")","v":""},{"$f":"IFERROR(VLOOKUP(INT((CN$1-10)/3)&\".YC\",CCR_0!$P:$Q,2,0),\"\")","v":""},{"$f":"IFERROR(VLOOKUP(INT((CO$1-10)/3)&\".YC\",CCR_0!$P:$Q,2,0),\"\")","v":""},{"$f":"IFERROR(VLOOKUP(INT((CP$1-10)/3)&\".YC\",CCR_0!$P:$Q,2,0),\"\")","v":""},{"$f":"IFERROR(VLOOKUP(INT((CQ$1-10)/3)&\".YC\",CCR_0!$P:$Q,2,0),\"\")","v":""},{"$f":"IFERROR(VLOOKUP(INT((CR$1-10)/3)&\".YC\",CCR_0!$P:$Q,2,0),\"\")","v":""},{"$f":"IFERROR(VLOOKUP(INT((CS$1-10)/3)&\".YC\",CCR_0!$P:$Q,2,0),\"\")","v":""},{"$f":"IFERROR(VLOOKUP(INT((CT$1-10)/3)&\".YC\",CCR_0!$P:$Q,2,0),\"\")","v":""},{"$f":"IFERROR(VLOOKUP(INT((CU$1-10)/3)&\".YC\",CCR_0!$P:$Q,2,0),\"\")","v":""},{"$f":"IFERROR(VLOOKUP(INT((CV$1-10)/3)&\".YC\",CCR_0!$P:$Q,2,0),\"\")","v":""},{"$f":"IFERROR(VLOOKUP(INT((CW$1-10)/3)&\".YC\",CCR_0!$P:$Q,2,0),\"\")","v":""},{"$f":"IFERROR(VLOOKUP(INT((CX$1-10)/3)&\".YC\",CCR_0!$P:$Q,2,0),\"\")","v":""},{"$f":"IFERROR(VLOOKUP(INT((CY$1-10)/3)&\".YC\",CCR_0!$P:$Q,2,0),\"\")","v":""},{"$f":"IFERROR(VLOOKUP(INT((CZ$1-10)/3)&\".YC\",CCR_0!$P:$Q,2,0),\"\")","v":""},{"$f":"IFERROR(VLOOKUP(INT((DA$1-10)/3)&\".YC\",CCR_0!$P:$Q,2,0),\"\")","v":""},{"$f":"IFERROR(VLOOKUP(INT((DB$1-10)/3)&\".YC\",CCR_0!$P:$Q,2,0),\"\")","v":""},{"$f":"IFERROR(VLOOKUP(INT((DC$1-10)/3)&\".YC\",CCR_0!$P:$Q,2,0),\"\")","v":""},{"$f":"IFERROR(VLOOKUP(INT((DD$1-10)/3)&\".YC\",CCR_0!$P:$Q,2,0),\"\")","v":""},{"$f":"IFERROR(VLOOKUP(INT((DE$1-10)/3)&\".YC\",CCR_0!$P:$Q,2,0),\"\")","v":""},{"$f":"IFERROR(VLOOKUP(INT((DF$1-10)/3)&\".YC\",CCR_0!$P:$Q,2,0),\"\")","v":""},{"$f":"IFERROR(VLOOKUP(INT((DG$1-10)/3)&\".YC\",CCR_0!$P:$Q,2,0),\"\")","v":""},{"$f":"IFERROR(VLOOKUP(INT((DH$1-10)/3)&\".YC\",CCR_0!$P:$Q,2,0),\"\")","v":""},{"$f":"IFERROR(VLOOKUP(INT((DI$1-10)/3)&\".YC\",CCR_0!$P:$Q,2,0),\"\")","v":""},{"$f":"IFERROR(VLOOKUP(INT((DJ$1-10)/3)&\".YC\",CCR_0!$P:$Q,2,0),\"\")","v":""},{"$f":"IFERROR(VLOOKUP(INT((DK$1-10)/3)&\".YC\",CCR_0!$P:$Q,2,0),\"\")","v":""},{"$f":"IFERROR(VLOOKUP(INT((DL$1-10)/3)&\".YC\",CCR_0!$P:$Q,2,0),\"\")","v":""},{"$f":"IFERROR(VLOOKUP(INT((DM$1-10)/3)&\".YC\",CCR_0!$P:$Q,2,0),\"\")","v":""},{"$f":"IFERROR(VLOOKUP(INT((DN$1-10)/3)&\".YC\",CCR_0!$P:$Q,2,0),\"\")","v":""},{"$f":"IFERROR(VLOOKUP(INT((DO$1-10)/3)&\".YC\",CCR_0!$P:$Q,2,0),\"\")","v":""},{"$f":"IFERROR(VLOOKUP(INT((DP$1-10)/3)&\".YC\",CCR_0!$P:$Q,2,0),\"\")","v":""},{"$f":"IFERROR(VLOOKUP(INT((DQ$1-10)/3)&\".YC\",CCR_0!$P:$Q,2,0),\"\")","v":""},{"$f":"IFERROR(VLOOKUP(INT((DR$1-10)/3)&\".YC\",CCR_0!$P:$Q,2,0),\"\")","v":""},{"$f":"IFERROR(VLOOKUP(INT((DS$1-10)/3)&\".YC\",CCR_0!$P:$Q,2,0),\"\")","v":""},{"$f":"IFERROR(VLOOKUP(INT((DT$1-10)/3)&\".YC\",CCR_0!$P:$Q,2,0),\"\")","v":""},{"$f":"IFERROR(VLOOKUP(INT((DU$1-10)/3)&\".YC\",CCR_0!$P:$Q,2,0),\"\")","v":""},{"$f":"IFERROR(VLOOKUP(INT((DV$1-10)/3)&\".YC\",CCR_0!$P:$Q,2,0),\"\")","v":""},{"$f":"IFERROR(VLOOKUP(INT((DW$1-10)/3)&\".YC\",CCR_0!$P:$Q,2,0),\"\")","v":""},{"$f":"IFERROR(VLOOKUP(INT((DX$1-10)/3)&\".YC\",CCR_0!$P:$Q,2,0),\"\")","v":""},{"$f":"IFERROR(VLOOKUP(INT((DY$1-10)/3)&\".YC\",CCR_0!$P:$Q,2,0),\"\")","v":""},{"$f":"IFERROR(VLOOKUP(INT((DZ$1-10)/3)&\".YC\",CCR_0!$P:$Q,2,0),\"\")","v":""},{"$f":"IFERROR(VLOOKUP(INT((EA$1-10)/3)&\".YC\",CCR_0!$P:$Q,2,0),\"\")","v":""},{"$f":"IFERROR(VLOOKUP(INT((EB$1-10)/3)&\".YC\",CCR_0!$P:$Q,2,0),\"\")","v":""},{"$f":"IFERROR(VLOOKUP(INT((EC$1-10)/3)&\".YC\",CCR_0!$P:$Q,2,0),\"\")","v":""},{"$f":"IFERROR(VLOOKUP(INT((ED$1-10)/3)&\".YC\",CCR_0!$P:$Q,2,0),\"\")","v":""},{"$f":"IFERROR(VLOOKUP(INT((EE$1-10)/3)&\".YC\",CCR_0!$P:$Q,2,0),\"\")","v":""},{"$f":"IFERROR(VLOOKUP(INT((EF$1-10)/3)&\".YC\",CCR_0!$P:$Q,2,0),\"\")","v":""},{"$f":"IFERROR(VLOOKUP(INT((EG$1-10)/3)&\".YC\",CCR_0!$P:$Q,2,0),\"\")","v":""},{"$f":"IFERROR(VLOOKUP(INT((EH$1-10)/3)&\".YC\",CCR_0!$P:$Q,2,0),\"\")","v":""},{"$f":"IFERROR(VLOOKUP(INT((EI$1-10)/3)&\".YC\",CCR_0!$P:$Q,2,0),\"\")","v":""},{"$f":"IFERROR(VLOOKUP(INT((EJ$1-10)/3)&\".YC\",CCR_0!$P:$Q,2,0),\"\")","v":""},{"$f":"IFERROR(VLOOKUP(INT((EK$1-10)/3)&\".YC\",CCR_0!$P:$Q,2,0),\"\")","v":""},{"$f":"IFERROR(VLOOKUP(INT((EL$1-10)/3)&\".YC\",CCR_0!$P:$Q,2,0),\"\")","v":""},{"$f":"IFERROR(VLOOKUP(INT((EM$1-10)/3)&\".YC\",CCR_0!$P:$Q,2,0),\"\")","v":""},{"$f":"IFERROR(VLOOKUP(INT((EN$1-10)/3)&\".YC\",CCR_0!$P:$Q,2,0),\"\")","v":""},{"$f":"IFERROR(VLOOKUP(INT((EO$1-10)/3)&\".YC\",CCR_0!$P:$Q,2,0),\"\")","v":""},{"$f":"IFERROR(VLOOKUP(INT((EP$1-10)/3)&\".YC\",CCR_0!$P:$Q,2,0),\"\")","v":""},{"$f":"IFERROR(VLOOKUP(INT((EQ$1-10)/3)&\".YC\",CCR_0!$P:$Q,2,0),\"\")","v":""},{"$f":"IFERROR(VLOOKUP(INT((ER$1-10)/3)&\".YC\",CCR_0!$P:$Q,2,0),\"\")","v":""},{"$f":"IFERROR(VLOOKUP(INT((ES$1-10)/3)&\".YC\",CCR_0!$P:$Q,2,0),\"\")","v":""},{"$f":"IFERROR(VLOOKUP(INT((ET$1-10)/3)&\".YC\",CCR_0!$P:$Q,2,0),\"\")","v":""},{"$f":"IFERROR(VLOOKUP(INT((EU$1-10)/3)&\".YC\",CCR_0!$P:$Q,2,0),\"\")","v":""},{"$f":"IFERROR(VLOOKUP(INT((EV$1-10)/3)&\".YC\",CCR_0!$P:$Q,2,0),\"\")","v":""},{"$f":"IFERROR(VLOOKUP(INT((EW$1-10)/3)&\".YC\",CCR_0!$P:$Q,2,0),\"\")","v":""},{"$f":"IFERROR(VLOOKUP(INT((EX$1-10)/3)&\".YC\",CCR_0!$P:$Q,2,0),\"\")","v":""},{"$f":"IFERROR(VLOOKUP(INT((EY$1-10)/3)&\".YC\",CCR_0!$P:$Q,2,0),\"\")","v":""},{"$f":"IFERROR(VLOOKUP(INT((EZ$1-10)/3)&\".YC\",CCR_0!$P:$Q,2,0),\"\")","v":""},{"$f":"IFERROR(VLOOKUP(INT((FA$1-10)/3)&\".YC\",CCR_0!$P:$Q,2,0),\"\")","v":""},{"$f":"IFERROR(VLOOKUP(INT((FB$1-10)/3)&\".YC\",CCR_0!$P:$Q,2,0),\"\")","v":""},{"$f":"IFERROR(VLOOKUP(INT((FC$1-10)/3)&\".YC\",CCR_0!$P:$Q,2,0),\"\")","v":""},{"$f":"IFERROR(VLOOKUP(INT((FD$1-10)/3)&\".YC\",CCR_0!$P:$Q,2,0),\"\")","v":""},{"$f":"IFERROR(VLOOKUP(INT((FE$1-10)/3)&\".YC\",CCR_0!$P:$Q,2,0),\"\")","v":""},{"$f":"IFERROR(VLOOKUP(INT((FF$1-10)/3)&\".YC\",CCR_0!$P:$Q,2,0),\"\")","v":""},{"$f":"IFERROR(VLOOKUP(INT((FG$1-10)/3)&\".YC\",CCR_0!$P:$Q,2,0),\"\")","v":""},{"$f":"IFERROR(VLOOKUP(INT((FH$1-10)/3)&\".YC\",CCR_0!$P:$Q,2,0),\"\")","v":""},{"$f":"IFERROR(VLOOKUP(INT((FI$1-10)/3)&\".YC\",CCR_0!$P:$Q,2,0),\"\")","v":""},{"$f":"IFERROR(VLOOKUP(INT((FJ$1-10)/3)&\".YC\",CCR_0!$P:$Q,2,0),\"\")","v":""},{"$f":"IFERROR(VLOOKUP(INT((FK$1-10)/3)&\".YC\",CCR_0!$P:$Q,2,0),\"\")","v":""},{"$f":"IFERROR(VLOOKUP(INT((FL$1-10)/3)&\".YC\",CCR_0!$P:$Q,2,0),\"\")","v":""},{"$f":"IFERROR(VLOOKUP(INT((FM$1-10)/3)&\".YC\",CCR_0!$P:$Q,2,0),\"\")","v":""},{"$f":"IFERROR(VLOOKUP(INT((FN$1-10)/3)&\".YC\",CCR_0!$P:$Q,2,0),\"\")","v":""},{"$f":"IFERROR(VLOOKUP(INT((FO$1-10)/3)&\".YC\",CCR_0!$P:$Q,2,0),\"\")","v":""},{"$f":"IFERROR(VLOOKUP(INT((FP$1-10)/3)&\".YC\",CCR_0!$P:$Q,2,0),\"\")","v":""},{"$f":"IFERROR(VLOOKUP(INT((FQ$1-10)/3)&\".YC\",CCR_0!$P:$Q,2,0),\"\")","v":""},{"$f":"IFERROR(VLOOKUP(INT((FR$1-10)/3)&\".YC\",CCR_0!$P:$Q,2,0),\"\")","v":""},{"$f":"IFERROR(VLOOKUP(INT((FS$1-10)/3)&\".YC\",CCR_0!$P:$Q,2,0),\"\")","v":""},{"$f":"IFERROR(VLOOKUP(INT((FT$1-10)/3)&\".YC\",CCR_0!$P:$Q,2,0),\"\")","v":""},{"$f":"IFERROR(VLOOKUP(INT((FU$1-10)/3)&\".YC\",CCR_0!$P:$Q,2,0),\"\")","v":""},{"$f":"IFERROR(VLOOKUP(INT((FV$1-10)/3)&\".YC\",CCR_0!$P:$Q,2,0),\"\")","v":""},{"$f":"IFERROR(VLOOKUP(INT((FW$1-10)/3)&\".YC\",CCR_0!$P:$Q,2,0),\"\")","v":""},{"$f":"IFERROR(VLOOKUP(INT((FX$1-10)/3)&\".YC\",CCR_0!$P:$Q,2,0),\"\")","v":""},{"$f":"IFERROR(VLOOKUP(INT((FY$1-10)/3)&\".YC\",CCR_0!$P:$Q,2,0),\"\")","v":""},{"$f":"IFERROR(VLOOKUP(INT((FZ$1-10)/3)&\".YC\",CCR_0!$P:$Q,2,0),\"\")","v":""},{"$f":"IFERROR(VLOOKUP(INT((GA$1-10)/3)&\".YC\",CCR_0!$P:$Q,2,0),\"\")","v":""},{"$f":"IFERROR(VLOOKUP(INT((GB$1-10)/3)&\".YC\",CCR_0!$P:$Q,2,0),\"\")","v":""},{"$f":"IFERROR(VLOOKUP(INT((GC$1-10)/3)&\".YC\",CCR_0!$P:$Q,2,0),\"\")","v":""},{"$f":"IFERROR(VLOOKUP(INT((GD$1-10)/3)&\".YC\",CCR_0!$P:$Q,2,0),\"\")","v":""},{"$f":"IFERROR(VLOOKUP(INT((GE$1-10)/3)&\".YC\",CCR_0!$P:$Q,2,0),\"\")","v":""},{"$f":"IFERROR(VLOOKUP(INT((GF$1-10)/3)&\".YC\",CCR_0!$P:$Q,2,0),\"\")","v":""},{"$f":"IFERROR(VLOOKUP(INT((GG$1-10)/3)&\".YC\",CCR_0!$P:$Q,2,0),\"\")","v":""},{"$f":"IFERROR(VLOOKUP(INT((GH$1-10)/3)&\".YC\",CCR_0!$P:$Q,2,0),\"\")","v":""},{"$f":"IFERROR(VLOOKUP(INT((GI$1-10)/3)&\".YC\",CCR_0!$P:$Q,2,0),\"\")","v":""},{"$f":"IFERROR(VLOOKUP(INT((GJ$1-10)/3)&\".YC\",CCR_0!$P:$Q,2,0),\"\")","v":""},{"$f":"IFERROR(VLOOKUP(INT((GK$1-10)/3)&\".YC\",CCR_0!$P:$Q,2,0),\"\")","v":""},{"$f":"IFERROR(VLOOKUP(INT((GL$1-10)/3)&\".YC\",CCR_0!$P:$Q,2,0),\"\")","v":""},{"$f":"IFERROR(VLOOKUP(INT((GM$1-10)/3)&\".YC\",CCR_0!$P:$Q,2,0),\"\")","v":""},{"$f":"IFERROR(VLOOKUP(INT((GN$1-10)/3)&\".YC\",CCR_0!$P:$Q,2,0),\"\")","v":""},{"$f":"IFERROR(VLOOKUP(INT((GO$1-10)/3)&\".YC\",CCR_0!$P:$Q,2,0),\"\")","v":""},{"$f":"IFERROR(VLOOKUP(INT((GP$1-10)/3)&\".YC\",CCR_0!$P:$Q,2,0),\"\")","v":""},{"$f":"IFERROR(VLOOKUP(INT((GQ$1-10)/3)&\".YC\",CCR_0!$P:$Q,2,0),\"\")","v":""},{"$f":"IFERROR(VLOOKUP(INT((GR$1-10)/3)&\".YC\",CCR_0!$P:$Q,2,0),\"\")","v":""},{"$f":"IFERROR(VLOOKUP(INT((GS$1-10)/3)&\".YC\",CCR_0!$P:$Q,2,0),\"\")","v":""},{"$f":"IFERROR(VLOOKUP(INT((GT$1-10)/3)&\".YC\",CCR_0!$P:$Q,2,0),\"\")","v":""},{"$f":"IFERROR(VLOOKUP(INT((GU$1-10)/3)&\".YC\",CCR_0!$P:$Q,2,0),\"\")","v":""},{"$f":"IFERROR(VLOOKUP(INT((GV$1-10)/3)&\".YC\",CCR_0!$P:$Q,2,0),\"\")","v":""},{"$f":"IFERROR(VLOOKUP(INT((GW$1-10)/3)&\".YC\",CCR_0!$P:$Q,2,0),\"\")","v":""},{"$f":"IFERROR(VLOOKUP(INT((GX$1-10)/3)&\".YC\",CCR_0!$P:$Q,2,0),\"\")","v":""},{"$f":"IFERROR(VLOOKUP(INT((GY$1-10)/3)&\".YC\",CCR_0!$P:$Q,2,0),\"\")","v":""},{"$f":"IFERROR(VLOOKUP(INT((GZ$1-10)/3)&\".YC\",CCR_0!$P:$Q,2,0),\"\")","v":""},{"$f":"IFERROR(VLOOKUP(INT((HA$1-10)/3)&\".YC\",CCR_0!$P:$Q,2,0),\"\")","v":""},{"$f":"IFERROR(VLOOKUP(INT((HB$1-10)/3)&\".YC\",CCR_0!$P:$Q,2,0),\"\")","v":""},{"$f":"IFERROR(VLOOKUP(INT((HC$1-10)/3)&\".YC\",CCR_0!$P:$Q,2,0),\"\")","v":""},{"$f":"IFERROR(VLOOKUP(INT((HD$1-10)/3)&\".YC\",CCR_0!$P:$Q,2,0),\"\")","v":""},{"$f":"IFERROR(VLOOKUP(INT((HE$1-10)/3)&\".YC\",CCR_0!$P:$Q,2,0),\"\")","v":""},{"$f":"IFERROR(VLOOKUP(INT((HF$1-10)/3)&\".YC\",CCR_0!$P:$Q,2,0),\"\")","v":""},{"$f":"IFERROR(VLOOKUP(INT((HG$1-10)/3)&\".YC\",CCR_0!$P:$Q,2,0),\"\")","v":""},{"$f":"IFERROR(VLOOKUP(INT((HH$1-10)/3)&\".YC\",CCR_0!$P:$Q,2,0),\"\")","v":""},{"$f":"IFERROR(VLOOKUP(INT((HI$1-10)/3)&\".YC\",CCR_0!$P:$Q,2,0),\"\")","v":""},{"$f":"IFERROR(VLOOKUP(INT((HJ$1-10)/3)&\".YC\",CCR_0!$P:$Q,2,0),\"\")","v":""},{"$f":"IFERROR(VLOOKUP(INT((HK$1-10)/3)&\".YC\",CCR_0!$P:$Q,2,0),\"\")","v":""},{"$f":"IFERROR(VLOOKUP(INT((HL$1-10)/3)&\".YC\",CCR_0!$P:$Q,2,0),\"\")","v":""},{"$f":"IFERROR(VLOOKUP(INT((HM$1-10)/3)&\".YC\",CCR_0!$P:$Q,2,0),\"\")","v":""},{"$f":"IFERROR(VLOOKUP(INT((HN$1-10)/3)&\".YC\",CCR_0!$P:$Q,2,0),\"\")","v":""},{"$f":"IFERROR(VLOOKUP(INT((HO$1-10)/3)&\".YC\",CCR_0!$P:$Q,2,0),\"\")","v":""},{"$f":"IFERROR(VLOOKUP(INT((HP$1-10)/3)&\".YC\",CCR_0!$P:$Q,2,0),\"\")","v":""},{"$f":"IFERROR(VLOOKUP(INT((HQ$1-10)/3)&\".YC\",CCR_0!$P:$Q,2,0),\"\")","v":""}]
[]
["TBI Provider ID",null,{"$f":"+IF(CCR_0!$C$4=\"\",\"\",CCR_0!$C$4)","v":""},null,"NHTD Provider ID ",null,{"$f":"+IF(CCR_0!$G$4=\"\",\"\",CCR_0!$G$4)","v":""}]
["Agency Name",null,{"$f":"+IF(CCR_0!$C$5=\"\",\"\",IF(LEFT(CCR_0!$C$5,5) = \"C1010\", CCR_0!$C$6,CCR_0!$C$5))","v":""},null,null,null,null,null,null,"NEW YORK STATE"]
["New Agency",null,null,null,null,null,null,null,null,"CERTIFIED COST REPORT"]
["Funding State Agency",null,null,null,null,null,"Reporting Period"]
[null,null,"DOH",null,null,null,"Start Date","End Date",null,"SCHEDULE CCR-4"]
[null,null,"TBI","NHTD",null,null,"mm/dd/yyyy","mm/dd/yyyy",null,"PERSONAL"]
["NO",null,{"$f":"IF(CCR_0!C$10=\"\",\"\",CCR_0!C$10)","v":""},{"$f":"IF(CCR_0!D$10=\"\",\"\",CCR_0!D$10)","v":""},"NO",null,{"$f":"IF(CCR_1!G$10=\"\",\"\", CCR_1!G$10)","v":""},{"$f":"IF(CCR_1!H$10=\"\",\"\", CCR_1!H$10)","v":""},null,"SERVICE",null,null,null,"Rev. Feb. 2021"]
[]
["Provide all applicable information. Refer to Appendix F for Position Title Codes and Definitions."]
["Indicate the standard work week or provide the number of hours in the \"other\" column."]
["Indicate the applicable staffing category on the line below to which each page applies."]
[null,"PROGRAM/SITE-PROGRAM ADMIN.(Position Title Codes 100-599 and 700-700-799 series)"]
[null,"AGENCY ADMINISTRATION (Position Title Codes 600-699 series) *"]
["Position\nTitle Code\nAppendix\nF","Column Number",null,null,null,null,null,null,"`",null,null,null,{"$f":"+IF(N2=\"\",\"\",J17+1)","v":""},null,null,{"$f":"+IF(Q2=\"\",\"\",M17+1)","v":""},null,null,{"$f":"+IF(T2=\"\",\"\",P17+1)","v":""},null,null,{"$f":"+IF(W2=\"\",\"\",S17+1)","v":""},null,null,{"$f":"+IF(Z2=\"\",\"\",V17+1)","v":""},null,null,{"$f":"+IF(AC2=\"\",\"\",Y17+1)","v":""},null,null,{"$f":"+IF(AF2=\"\",\"\",AB17+1)","v":""},null,null,{"$f":"+IF(AI2=\"\",\"\",AE17+1)","v":""},null,null,{"$f":"+IF(AL2=\"\",\"\",AH17+1)","v":""},null,null,{"$f":"+IF(AO2=\"\",\"\",AK17+1)","v":""},null,null,{"$f":"+IF(AR2=\"\",\"\",AN17+1)","v":""},null,null,{"$f":"+IF(AU2=\"\",\"\",AQ17+1)","v":""},null,null,{"$f":"+IF(AX2=\"\",\"\",AT17+1)","v":""},null,null,{"$f":"+IF(BA2=\"\",\"\",AW17+1)","v":""},null,null,{"$f":"+IF(BD2=\"\",\"\",AZ17+1)","v":""},null,null,{"$f":"+IF(BG2=\"\",\"\",BC17+1)","v":""},null,null,{"$f":"+IF(BJ2=\"\",\"\",BF17+1)","v":""},null,null,{"$f":"+IF(BM2=\"\",\"\",BI17+1)","v":""},null,null,{"$f":"+IF(BP2=\"\",\"\",BL17+1)","v":""},null,null,{"$f":"+IF(BS2=\"\",\"\",BO17+1)","v":""},null,null,{"$f":"+IF(BV2=\"\",\"\",BR17+1)","v":""},null,null,{"$f":"+IF(BY2=\"\",\"\",BU17+1)","v":""},null,null,{"$f":"+IF(CB2=\"\",\"\",BX17+1)","v":""},null,null,{"$f":"+IF(CE2=\"\",\"\",CA17+1)","v":""},null,null,{"$f":"+IF(CH2=\"\",\"\",CD17+1)","v":""},null,null,{"$f":"+IF(CK2=\"\",\"\",CG17+1)","v":""},null,null,{"$f":"+IF(CN2=\"\",\"\",CJ17+1)","v":""},null,null,{"$f":"+IF(CQ2=\"\",\"\",CM17+1)","v":""},null,null,{"$f":"+IF(CT2=\"\",\"\",CP17+1)","v":""},null,null,{"$f":"+IF(CW2=\"\",\"\",CS17+1)","v":""},null,null,{"$f":"+IF(CZ2=\"\",\"\",CV17+1)","v":""},null,null,{"$f":"+IF(DC2=\"\",\"\",CY17+1)","v":""},null,null,{"$f":"+IF(DF2=\"\",\"\",DB17+1)","v":""},null,null,{"$f":"+IF(DI2=\"\",\"\",DE17+1)","v":""},null,null,{"$f":"+IF(DL2=\"\",\"\",DH17+1)","v":""},null,null,{"$f":"+IF(DO2=\"\",\"\",DK17+1)","v":""},null,null,{"$f":"+IF(DR2=\"\",\"\",DN17+1)","v":""},null,null,{"$f":"+IF(DU2=\"\",\"\",DQ17+1)","v":""},null,null,{"$f":"+IF(DX2=\"\",\"\",DT17+1)","v":""},null,null,{"$f":"+IF(EA2=\"\",\"\",DW17+1)","v":""},null,null,{"$f":"+IF(ED2=\"\",\"\",DZ17+1)","v":""},null,null,{"$f":"+IF(EG2=\"\",\"\",EC17+1)","v":""},null,null,{"$f":"+IF(EJ2=\"\",\"\",EF17+1)","v":""},null,null,{"$f":"+IF(EM2=\"\",\"\",EI17+1)","v":""},null,null,{"$f":"+IF(EP2=\"\",\"\",EL17+1)","v":""},null,null,{"$f":"+IF(ES2=\"\",\"\",EO17+1)","v":""},null,null,{"$f":"+IF(EV2=\"\",\"\",ER17+1)","v":""},null,null,{"$f":"+IF(EY2=\"\",\"\",EU17+1)","v":""},null,null,{"$f":"+IF(FB2=\"\",\"\",EX17+1)","v":""},null,null,{"$f":"+IF(FE2=\"\",\"\",FA17+1)","v":""},null,null,{"$f":"+IF(FH2=\"\",\"\",FD17+1)","v":""},null,null,{"$f":"+IF(FK2=\"\",\"\",FG17+1)","v":""},null,null,{"$f":"+IF(FN2=\"\",\"\",FJ17+1)","v":""},null,null,{"$f":"+IF(FQ2=\"\",\"\",FM17+1)","v":""},null,null,{"$f":"+IF(FT2=\"\",\"\",FP17+1)","v":""},null,null,{"$f":"+IF(FW2=\"\",\"\",FS17+1)","v":""},null,null,{"$f":"+IF(FZ2=\"\",\"\",FV17+1)","v":""},null,null,{"$f":"+IF(GC2=\"\",\"\",FY17+1)","v":""},null,null,{"$f":"+IF(GF2=\"\",\"\",GB17+1)","v":""},null,null,{"$f":"+IF(GI2=\"\",\"\",GE17+1)","v":""},null,null,{"$f":"+IF(GL2=\"\",\"\",GH17+1)","v":""},null,null,{"$f":"+IF(GO2=\"\",\"\",GK17+1)","v":""},null,null,{"$f":"+IF(GR2=\"\",\"\",GN17+1)","v":""},null,null,{"$f":"+IF(GU2=\"\",\"\",GQ17+1)","v":""},null,null,{"$f":"+IF(GX2=\"\",\"\",GT17+1)","v":""},null,null,{"$f":"+IF(HA2=\"\",\"\",GW17+1)","v":""},null,null,{"$f":"+IF(HD2=\"\",\"\",GZ17+1)","v":""},null,null,{"$f":"+IF(HG2=\"\",\"\",HC17+1)","v":""},null,null,{"$f":"+IF(HJ2=\"\",\"\",HF17+1)","v":""},null,null,{"$f":"+IF(HM2=\"\",\"\",HI17+1)","v":""},null,null,{"$f":"+IF(HP2=\"\",\"\",HL17+1)","v":""}]
[null,"Program Type",null,null,null,null,null,null,{"$f":"ROW(CCR_1!$A$16)","v":16},null,null,null,{"$f":"IF(M$2=\"\",\"\",INDIRECT(ADDRESS($I18,COLUMN(CCR_1!$J$1)+M$17-1,,,\"CCR_1\"))) & \"\"","v":""},null,null,{"$f":"IF(P$2=\"\",\"\",INDIRECT(ADDRESS($I18,COLUMN(CCR_1!$J$1)+P$17-1,,,\"CCR_1\"))) & \"\"","v":""},null,null,{"$f":"IF(S$2=\"\",\"\",INDIRECT(ADDRESS($I18,COLUMN(CCR_1!$J$1)+S$17-1,,,\"CCR_1\"))) & \"\"","v":""},null,null,{"$f":"IF(V$2=\"\",\"\",INDIRECT(ADDRESS($I18,COLUMN(CCR_1!$J$1)+V$17-1,,,\"CCR_1\"))) & \"\"","v":""},null,null,{"$f":"IF(Y$2=\"\",\"\",INDIRECT(ADDRESS($I18,COLUMN(CCR_1!$J$1)+Y$17-1,,,\"CCR_1\"))) & \"\"","v":""},null,null,{"$f":"IF(AB$2=\"\",\"\",INDIRECT(ADDRESS($I18,COLUMN(CCR_1!$J$1)+AB$17-1,,,\"CCR_1\"))) & \"\"","v":""},null,null,{"$f":"IF(AE$2=\"\",\"\",INDIRECT(ADDRESS($I18,COLUMN(CCR_1!$J$1)+AE$17-1,,,\"CCR_1\"))) & \"\"","v":""},null,null,{"$f":"IF(AH$2=\"\",\"\",INDIRECT(ADDRESS($I18,COLUMN(CCR_1!$J$1)+AH$17-1,,,\"CCR_1\"))) & \"\"","v":""},null,null,{"$f":"IF(AK$2=\"\",\"\",INDIRECT(ADDRESS($I18,COLUMN(CCR_1!$J$1)+AK$17-1,,,\"CCR_1\"))) & \"\"","v":""},null,null,{"$f":"IF(AN$2=\"\",\"\",INDIRECT(ADDRESS($I18,COLUMN(CCR_1!$J$1)+AN$17-1,,,\"CCR_1\"))) & \"\"","v":""},null,null,{"$f":"IF(AQ$2=\"\",\"\",INDIRECT(ADDRESS($I18,COLUMN(CCR_1!$J$1)+AQ$17-1,,,\"CCR_1\"))) & \"\"","v":""},null,null,{"$f":"IF(AT$2=\"\",\"\",INDIRECT(ADDRESS($I18,COLUMN(CCR_1!$J$1)+AT$17-1,,,\"CCR_1\"))) & \"\"","v":""},null,null,{"$f":"IF(AW$2=\"\",\"\",INDIRECT(ADDRESS($I18,COLUMN(CCR_1!$J$1)+AW$17-1,,,\"CCR_1\"))) & \"\"","v":""},null,null,{"$f":"IF(AZ$2=\"\",\"\",INDIRECT(ADDRESS($I18,COLUMN(CCR_1!$J$1)+AZ$17-1,,,\"CCR_1\"))) & \"\"","v":""},null,null,{"$f":"IF(BC$2=\"\",\"\",INDIRECT(ADDRESS($I18,COLUMN(CCR_1!$J$1)+BC$17-1,,,\"CCR_1\"))) & \"\"","v":""},null,null,{"$f":"IF(BF$2=\"\",\"\",INDIRECT(ADDRESS($I18,COLUMN(CCR_1!$J$1)+BF$17-1,,,\"CCR_1\"))) & \"\"","v":""},null,null,{"$f":"IF(BI$2=\"\",\"\",INDIRECT(ADDRESS($I18,COLUMN(CCR_1!$J$1)+BI$17-1,,,\"CCR_1\"))) & \"\"","v":""},null,null,{"$f":"IF(BL$2=\"\",\"\",INDIRECT(ADDRESS($I18,COLUMN(CCR_1!$J$1)+BL$17-1,,,\"CCR_1\"))) & \"\"","v":""},null,null,{"$f":"IF(BO$2=\"\",\"\",INDIRECT(ADDRESS($I18,COLUMN(CCR_1!$J$1)+BO$17-1,,,\"CCR_1\"))) & \"\"","v":""},null,null,{"$f":"IF(BR$2=\"\",\"\",INDIRECT(ADDRESS($I18,COLUMN(CCR_1!$J$1)+BR$17-1,,,\"CCR_1\"))) & \"\"","v":""},null,null,{"$f":"IF(BU$2=\"\",\"\",INDIRECT(ADDRESS($I18,COLUMN(CCR_1!$J$1)+BU$17-1,,,\"CCR_1\"))) & \"\"","v":""},null,null,{"$f":"IF(BX$2=\"\",\"\",INDIRECT(ADDRESS($I18,COLUMN(CCR_1!$J$1)+BX$17-1,,,\"CCR_1\"))) & \"\"","v":""},null,null,{"$f":"IF(CA$2=\"\",\"\",INDIRECT(ADDRESS($I18,COLUMN(CCR_1!$J$1)+CA$17-1,,,\"CCR_1\"))) & \"\"","v":""},null,null,{"$f":"IF(CD$2=\"\",\"\",INDIRECT(ADDRESS($I18,COLUMN(CCR_1!$J$1)+CD$17-1,,,\"CCR_1\"))) & \"\"","v":""},null,null,{"$f":"IF(CG$2=\"\",\"\",INDIRECT(ADDRESS($I18,COLUMN(CCR_1!$J$1)+CG$17-1,,,\"CCR_1\"))) & \"\"","v":""},null,null,{"$f":"IF(CJ$2=\"\",\"\",INDIRECT(ADDRESS($I18,COLUMN(CCR_1!$J$1)+CJ$17-1,,,\"CCR_1\"))) & \"\"","v":""},null,null,{"$f":"IF(CM$2=\"\",\"\",INDIRECT(ADDRESS($I18,COLUMN(CCR_1!$J$1)+CM$17-1,,,\"CCR_1\"))) & \"\"","v":""},null,null,{"$f":"IF(CP$2=\"\",\"\",INDIRECT(ADDRESS($I18,COLUMN(CCR_1!$J$1)+CP$17-1,,,\"CCR_1\"))) & \"\"","v":""},null,null,{"$f":"IF(CS$2=\"\",\"\",INDIRECT(ADDRESS($I18,COLUMN(CCR_1!$J$1)+CS$17-1,,,\"CCR_1\"))) & \"\"","v":""},null,null,{"$f":"IF(CV$2=\"\",\"\",INDIRECT(ADDRESS($I18,COLUMN(CCR_1!$J$1)+CV$17-1,,,\"CCR_1\"))) & \"\"","v":""},null,null,{"$f":"IF(CY$2=\"\",\"\",INDIRECT(ADDRESS($I18,COLUMN(CCR_1!$J$1)+CY$17-1,,,\"CCR_1\"))) & \"\"","v":""},null,null,{"$f":"IF(DB$2=\"\",\"\",INDIRECT(ADDRESS($I18,COLUMN(CCR_1!$J$1)+DB$17-1,,,\"CCR_1\"))) & \"\"","v":""},null,null,{"$f":"IF(DE$2=\"\",\"\",INDIRECT(ADDRESS($I18,COLUMN(CCR_1!$J$1)+DE$17-1,,,\"CCR_1\"))) & \"\"","v":""},null,null,{"$f":"IF(DH$2=\"\",\"\",INDIRECT(ADDRESS($I18,COLUMN(CCR_1!$J$1)+DH$17-1,,,\"CCR_1\"))) & \"\"","v":""},null,null,{"$f":"IF(DK$2=\"\",\"\",INDIRECT(ADDRESS($I18,COLUMN(CCR_1!$J$1)+DK$17-1,,,\"CCR_1\"))) & \"\"","v":""},null,null,{"$f":"IF(DN$2=\"\",\"\",INDIRECT(ADDRESS($I18,COLUMN(CCR_1!$J$1)+DN$17-1,,,\"CCR_1\"))) & \"\"","v":""},null,null,{"$f":"IF(DQ$2=\"\",\"\",INDIRECT(ADDRESS($I18,COLUMN(CCR_1!$J$1)+DQ$17-1,,,\"CCR_1\"))) & \"\"","v":""},null,null,{"$f":"IF(DT$2=\"\",\"\",INDIRECT(ADDRESS($I18,COLUMN(CCR_1!$J$1)+DT$17-1,,,\"CCR_1\"))) & \"\"","v":""},null,null,{"$f":"IF(DW$2=\"\",\"\",INDIRECT(ADDRESS($I18,COLUMN(CCR_1!$J$1)+DW$17-1,,,\"CCR_1\"))) & \"\"","v":""},null,null,{"$f":"IF(DZ$2=\"\",\"\",INDIRECT(ADDRESS($I18,COLUMN(CCR_1!$J$1)+DZ$17-1,,,\"CFR_1\"))) & \"\"","v":""},null,null,{"$f":"IF(EC$2=\"\",\"\",INDIRECT(ADDRESS($I18,COLUMN(CCR_1!$J$1)+EC$17-1,,,\"CFR_1\"))) & \"\"","v":""},null,null,{"$f":"IF(EF$2=\"\",\"\",INDIRECT(ADDRESS($I18,COLUMN(CCR_1!$J$1)+EF$17-1,,,\"CFR_1\"))) & \"\"","v":""},null,null,{"$f":"IF(EI$2=\"\",\"\",INDIRECT(ADDRESS($I18,COLUMN(CCR_1!$J$1)+EI$17-1,,,\"CFR_1\"))) & \"\"","v":""},null,null,{"$f":"IF(EL$2=\"\",\"\",INDIRECT(ADDRESS($I18,COLUMN(CCR_1!$J$1)+EL$17-1,,,\"CFR_1\"))) & \"\"","v":""},null,null,{"$f":"IF(EO$2=\"\",\"\",INDIRECT(ADDRESS($I18,COLUMN(CCR_1!$J$1)+EO$17-1,,,\"CFR_1\"))) & \"\"","v":""},null,null,{"$f":"IF(ER$2=\"\",\"\",INDIRECT(ADDRESS($I18,COLUMN(CCR_1!$J$1)+ER$17-1,,,\"CFR_1\"))) & \"\"","v":""},null,null,{"$f":"IF(EU$2=\"\",\"\",INDIRECT(ADDRESS($I18,COLUMN(CCR_1!$J$1)+EU$17-1,,,\"CFR_1\"))) & \"\"","v":""},null,null,{"$f":"IF(EX$2=\"\",\"\",INDIRECT(ADDRESS($I18,COLUMN(CCR_1!$J$1)+EX$17-1,,,\"CFR_1\"))) & \"\"","v":""},null,null,{"$f":"IF(FA$2=\"\",\"\",INDIRECT(ADDRESS($I18,COLUMN(CCR_1!$J$1)+FA$17-1,,,\"CFR_1\"))) & \"\"","v":""},null,null,{"$f":"IF(FD$2=\"\",\"\",INDIRECT(ADDRESS($I18,COLUMN(CCR_1!$J$1)+FD$17-1,,,\"CFR_1\"))) & \"\"","v":""},null,null,{"$f":"IF(FG$2=\"\",\"\",INDIRECT(ADDRESS($I18,COLUMN(CCR_1!$J$1)+FG$17-1,,,\"CFR_1\"))) & \"\"","v":""},null,null,{"$f":"IF(FJ$2=\"\",\"\",INDIRECT(ADDRESS($I18,COLUMN(CCR_1!$J$1)+FJ$17-1,,,\"CFR_1\"))) & \"\"","v":""},null,null,{"$f":"IF(FM$2=\"\",\"\",INDIRECT(ADDRESS($I18,COLUMN(CCR_1!$J$1)+FM$17-1,,,\"CFR_1\"))) & \"\"","v":""},null,null,{"$f":"IF(FP$2=\"\",\"\",INDIRECT(ADDRESS($I18,COLUMN(CCR_1!$J$1)+FP$17-1,,,\"CFR_1\"))) & \"\"","v":""},null,null,{"$f":"IF(FS$2=\"\",\"\",INDIRECT(ADDRESS($I18,COLUMN(CCR_1!$J$1)+FS$17-1,,,\"CFR_1\"))) & \"\"","v":""},null,null,{"$f":"IF(FV$2=\"\",\"\",INDIRECT(ADDRESS($I18,COLUMN(CCR_1!$J$1)+FV$17-1,,,\"CFR_1\"))) & \"\"","v":""},null,null,{"$f":"IF(FY$2=\"\",\"\",INDIRECT(ADDRESS($I18,COLUMN(CCR_1!$J$1)+FY$17-1,,,\"CFR_1\"))) & \"\"","v":""},null,null,{"$f":"IF(GB$2=\"\",\"\",INDIRECT(ADDRESS($I18,COLUMN(CCR_1!$J$1)+GB$17-1,,,\"CFR_1\"))) & \"\"","v":""},null,null,{"$f":"IF(GE$2=\"\",\"\",INDIRECT(ADDRESS($I18,COLUMN(CCR_1!$J$1)+GE$17-1,,,\"CFR_1\"))) & \"\"","v":""},null,null,{"$f":"IF(GH$2=\"\",\"\",INDIRECT(ADDRESS($I18,COLUMN(CCR_1!$J$1)+GH$17-1,,,\"CFR_1\"))) & \"\"","v":""},null,null,{"$f":"IF(GK$2=\"\",\"\",INDIRECT(ADDRESS($I18,COLUMN(CCR_1!$J$1)+GK$17-1,,,\"CFR_1\"))) & \"\"","v":""},null,null,{"$f":"IF(GN$2=\"\",\"\",INDIRECT(ADDRESS($I18,COLUMN(CCR_1!$J$1)+GN$17-1,,,\"CFR_1\"))) & \"\"","v":""},null,null,{"$f":"IF(GQ$2=\"\",\"\",INDIRECT(ADDRESS($I18,COLUMN(CCR_1!$J$1)+GQ$17-1,,,\"CFR_1\"))) & \"\"","v":""},null,null,{"$f":"IF(GT$2=\"\",\"\",INDIRECT(ADDRESS($I18,COLUMN(CCR_1!$J$1)+GT$17-1,,,\"CFR_1\"))) & \"\"","v":""},null,null,{"$f":"IF(GW$2=\"\",\"\",INDIRECT(ADDRESS($I18,COLUMN(CCR_1!$J$1)+GW$17-1,,,\"CFR_1\"))) & \"\"","v":""},null,null,{"$f":"IF(GZ$2=\"\",\"\",INDIRECT(ADDRESS($I18,COLUMN(CCR_1!$J$1)+GZ$17-1,,,\"CFR_1\"))) & \"\"","v":""},null,null,{"$f":"IF(HC$2=\"\",\"\",INDIRECT(ADDRESS($I18,COLUMN(CCR_1!$J$1)+HC$17-1,,,\"CFR_1\"))) & \"\"","v":""},null,null,{"$f":"IF(HF$2=\"\",\"\",INDIRECT(ADDRESS($I18,COLUMN(CCR_1!$J$1)+HF$17-1,,,\"CFR_1\"))) & \"\"","v":""},null,null,{"$f":"IF(HI$2=\"\",\"\",INDIRECT(ADDRESS($I18,COLUMN(CCR_1!$J$1)+HI$17-1,,,\"CFR_1\"))) & \"\"","v":""},null,null,{"$f":"IF(HL$2=\"\",\"\",INDIRECT(ADDRESS($I18,COLUMN(CCR_1!$J$1)+HL$17-1,,,\"CFR_1\"))) & \"\"","v":""},null,null,{"$f":"IF(HO$2=\"\",\"\",INDIRECT(ADDRESS($I18,COLUMN(CCR_1!$J$1)+HO$17-1,,,\"CFR_1\"))) & \"\"","v":""}]
[null,"PROGRAM CODE ** (PROGRAM CODE INDEX)",null,null,null,null,null,null,{"$f":"ROW(CCR_1!$A$17)","v":17},null,null,null,{"$f":"IF(M$2=\"\",\"\",INDIRECT(ADDRESS($I19,COLUMN(CCR_1!$J$1)+M$17-1,,,\"CCR_1\"))) & \"\"","v":""},null,null,{"$f":"IF(P$2=\"\",\"\",INDIRECT(ADDRESS($I19,COLUMN(CCR_1!$J$1)+P$17-1,,,\"CCR_1\"))) & \"\"","v":""},null,null,{"$f":"IF(S$2=\"\",\"\",INDIRECT(ADDRESS($I19,COLUMN(CCR_1!$J$1)+S$17-1,,,\"CCR_1\"))) & \"\"","v":""},null,null,{"$f":"IF(V$2=\"\",\"\",INDIRECT(ADDRESS($I19,COLUMN(CCR_1!$J$1)+V$17-1,,,\"CCR_1\"))) & \"\"","v":""},null,null,{"$f":"IF(Y$2=\"\",\"\",INDIRECT(ADDRESS($I19,COLUMN(CCR_1!$J$1)+Y$17-1,,,\"CCR_1\"))) & \"\"","v":""},null,null,{"$f":"IF(AB$2=\"\",\"\",INDIRECT(ADDRESS($I19,COLUMN(CCR_1!$J$1)+AB$17-1,,,\"CCR_1\"))) & \"\"","v":""},null,null,{"$f":"IF(AE$2=\"\",\"\",INDIRECT(ADDRESS($I19,COLUMN(CCR_1!$J$1)+AE$17-1,,,\"CCR_1\"))) & \"\"","v":""},null,null,{"$f":"IF(AH$2=\"\",\"\",INDIRECT(ADDRESS($I19,COLUMN(CCR_1!$J$1)+AH$17-1,,,\"CCR_1\"))) & \"\"","v":""},null,null,{"$f":"IF(AK$2=\"\",\"\",INDIRECT(ADDRESS($I19,COLUMN(CCR_1!$J$1)+AK$17-1,,,\"CCR_1\"))) & \"\"","v":""},null,null,{"$f":"IF(AN$2=\"\",\"\",INDIRECT(ADDRESS($I19,COLUMN(CCR_1!$J$1)+AN$17-1,,,\"CCR_1\"))) & \"\"","v":""},null,null,{"$f":"IF(AQ$2=\"\",\"\",INDIRECT(ADDRESS($I19,COLUMN(CCR_1!$J$1)+AQ$17-1,,,\"CCR_1\"))) & \"\"","v":""},null,null,{"$f":"IF(AT$2=\"\",\"\",INDIRECT(ADDRESS($I19,COLUMN(CCR_1!$J$1)+AT$17-1,,,\"CCR_1\"))) & \"\"","v":""},null,null,{"$f":"IF(AW$2=\"\",\"\",INDIRECT(ADDRESS($I19,COLUMN(CCR_1!$J$1)+AW$17-1,,,\"CCR_1\"))) & \"\"","v":""},null,null,{"$f":"IF(AZ$2=\"\",\"\",INDIRECT(ADDRESS($I19,COLUMN(CCR_1!$J$1)+AZ$17-1,,,\"CCR_1\"))) & \"\"","v":""},null,null,{"$f":"IF(BC$2=\"\",\"\",INDIRECT(ADDRESS($I19,COLUMN(CCR_1!$J$1)+BC$17-1,,,\"CCR_1\"))) & \"\"","v":""},null,null,{"$f":"IF(BF$2=\"\",\"\",INDIRECT(ADDRESS($I19,COLUMN(CCR_1!$J$1)+BF$17-1,,,\"CCR_1\"))) & \"\"","v":""},null,null,{"$f":"IF(BI$2=\"\",\"\",INDIRECT(ADDRESS($I19,COLUMN(CCR_1!$J$1)+BI$17-1,,,\"CCR_1\"))) & \"\"","v":""},null,null,{"$f":"IF(BL$2=\"\",\"\",INDIRECT(ADDRESS($I19,COLUMN(CCR_1!$J$1)+BL$17-1,,,\"CCR_1\"))) & \"\"","v":""},null,null,{"$f":"IF(BO$2=\"\",\"\",INDIRECT(ADDRESS($I19,COLUMN(CCR_1!$J$1)+BO$17-1,,,\"CCR_1\"))) & \"\"","v":""},null,null,{"$f":"IF(BR$2=\"\",\"\",INDIRECT(ADDRESS($I19,COLUMN(CCR_1!$J$1)+BR$17-1,,,\"CCR_1\"))) & \"\"","v":""},null,null,{"$f":"IF(BU$2=\"\",\"\",INDIRECT(ADDRESS($I19,COLUMN(CCR_1!$J$1)+BU$17-1,,,\"CCR_1\"))) & \"\"","v":""},null,null,{"$f":"IF(BX$2=\"\",\"\",INDIRECT(ADDRESS($I19,COLUMN(CCR_1!$J$1)+BX$17-1,,,\"CCR_1\"))) & \"\"","v":""},null,null,{"$f":"IF(CA$2=\"\",\"\",INDIRECT(ADDRESS($I19,COLUMN(CCR_1!$J$1)+CA$17-1,,,\"CCR_1\"))) & \"\"","v":""},null,null,{"$f":"IF(CD$2=\"\",\"\",INDIRECT(ADDRESS($I19,COLUMN(CCR_1!$J$1)+CD$17-1,,,\"CCR_1\"))) & \"\"","v":""},null,null,{"$f":"IF(CG$2=\"\",\"\",INDIRECT(ADDRESS($I19,COLUMN(CCR_1!$J$1)+CG$17-1,,,\"CCR_1\"))) & \"\"","v":""},null,null,{"$f":"IF(CJ$2=\"\",\"\",INDIRECT(ADDRESS($I19,COLUMN(CCR_1!$J$1)+CJ$17-1,,,\"CCR_1\"))) & \"\"","v":""},null,null,{"$f":"IF(CM$2=\"\",\"\",INDIRECT(ADDRESS($I19,COLUMN(CCR_1!$J$1)+CM$17-1,,,\"CCR_1\"))) & \"\"","v":""},null,null,{"$f":"IF(CP$2=\"\",\"\",INDIRECT(ADDRESS($I19,COLUMN(CCR_1!$J$1)+CP$17-1,,,\"CCR_1\"))) & \"\"","v":""},null,null,{"$f":"IF(CS$2=\"\",\"\",INDIRECT(ADDRESS($I19,COLUMN(CCR_1!$J$1)+CS$17-1,,,\"CCR_1\"))) & \"\"","v":""},null,null,{"$f":"IF(CV$2=\"\",\"\",INDIRECT(ADDRESS($I19,COLUMN(CCR_1!$J$1)+CV$17-1,,,\"CCR_1\"))) & \"\"","v":""},null,null,{"$f":"IF(CY$2=\"\",\"\",INDIRECT(ADDRESS($I19,COLUMN(CCR_1!$J$1)+CY$17-1,,,\"CCR_1\"))) & \"\"","v":""},null,null,{"$f":"IF(DB$2=\"\",\"\",INDIRECT(ADDRESS($I19,COLUMN(CCR_1!$J$1)+DB$17-1,,,\"CCR_1\"))) & \"\"","v":""},null,null,{"$f":"IF(DE$2=\"\",\"\",INDIRECT(ADDRESS($I19,COLUMN(CCR_1!$J$1)+DE$17-1,,,\"CCR_1\"))) & \"\"","v":""},null,null,{"$f":"IF(DH$2=\"\",\"\",INDIRECT(ADDRESS($I19,COLUMN(CCR_1!$J$1)+DH$17-1,,,\"CCR_1\"))) & \"\"","v":""},null,null,{"$f":"IF(DK$2=\"\",\"\",INDIRECT(ADDRESS($I19,COLUMN(CCR_1!$J$1)+DK$17-1,,,\"CCR_1\"))) & \"\"","v":""},null,null,{"$f":"IF(DN$2=\"\",\"\",INDIRECT(ADDRESS($I19,COLUMN(CCR_1!$J$1)+DN$17-1,,,\"CCR_1\"))) & \"\"","v":""},null,null,{"$f":"IF(DQ$2=\"\",\"\",INDIRECT(ADDRESS($I19,COLUMN(CCR_1!$J$1)+DQ$17-1,,,\"CCR_1\"))) & \"\"","v":""},null,null,{"$f":"IF(DT$2=\"\",\"\",INDIRECT(ADDRESS($I19,COLUMN(CCR_1!$J$1)+DT$17-1,,,\"CCR_1\"))) & \"\"","v":""},null,null,{"$f":"IF(DW$2=\"\",\"\",INDIRECT(ADDRESS($I19,COLUMN(CCR_1!$J$1)+DW$17-1,,,\"CCR_1\"))) & \"\"","v":""},null,null,{"$f":"IF(DZ$2=\"\",\"\",INDIRECT(ADDRESS($I19,COLUMN(CCR_1!$J$1)+DZ$17-1,,,\"CFR_1\"))) & \"\"","v":""},null,null,{"$f":"IF(EC$2=\"\",\"\",INDIRECT(ADDRESS($I19,COLUMN(CCR_1!$J$1)+EC$17-1,,,\"CFR_1\"))) & \"\"","v":""},null,null,{"$f":"IF(EF$2=\"\",\"\",INDIRECT(ADDRESS($I19,COLUMN(CCR_1!$J$1)+EF$17-1,,,\"CFR_1\"))) & \"\"","v":""},null,null,{"$f":"IF(EI$2=\"\",\"\",INDIRECT(ADDRESS($I19,COLUMN(CCR_1!$J$1)+EI$17-1,,,\"CFR_1\"))) & \"\"","v":""},null,null,{"$f":"IF(EL$2=\"\",\"\",INDIRECT(ADDRESS($I19,COLUMN(CCR_1!$J$1)+EL$17-1,,,\"CFR_1\"))) & \"\"","v":""},null,null,{"$f":"IF(EO$2=\"\",\"\",INDIRECT(ADDRESS($I19,COLUMN(CCR_1!$J$1)+EO$17-1,,,\"CFR_1\"))) & \"\"","v":""},null,null,{"$f":"IF(ER$2=\"\",\"\",INDIRECT(ADDRESS($I19,COLUMN(CCR_1!$J$1)+ER$17-1,,,\"CFR_1\"))) & \"\"","v":""},null,null,{"$f":"IF(EU$2=\"\",\"\",INDIRECT(ADDRESS($I19,COLUMN(CCR_1!$J$1)+EU$17-1,,,\"CFR_1\"))) & \"\"","v":""},null,null,{"$f":"IF(EX$2=\"\",\"\",INDIRECT(ADDRESS($I19,COLUMN(CCR_1!$J$1)+EX$17-1,,,\"CFR_1\"))) & \"\"","v":""},null,null,{"$f":"IF(FA$2=\"\",\"\",INDIRECT(ADDRESS($I19,COLUMN(CCR_1!$J$1)+FA$17-1,,,\"CFR_1\"))) & \"\"","v":""},null,null,{"$f":"IF(FD$2=\"\",\"\",INDIRECT(ADDRESS($I19,COLUMN(CCR_1!$J$1)+FD$17-1,,,\"CFR_1\"))) & \"\"","v":""},null,null,{"$f":"IF(FG$2=\"\",\"\",INDIRECT(ADDRESS($I19,COLUMN(CCR_1!$J$1)+FG$17-1,,,\"CFR_1\"))) & \"\"","v":""},null,null,{"$f":"IF(FJ$2=\"\",\"\",INDIRECT(ADDRESS($I19,COLUMN(CCR_1!$J$1)+FJ$17-1,,,\"CFR_1\"))) & \"\"","v":""},null,null,{"$f":"IF(FM$2=\"\",\"\",INDIRECT(ADDRESS($I19,COLUMN(CCR_1!$J$1)+FM$17-1,,,\"CFR_1\"))) & \"\"","v":""},null,null,{"$f":"IF(FP$2=\"\",\"\",INDIRECT(ADDRESS($I19,COLUMN(CCR_1!$J$1)+FP$17-1,,,\"CFR_1\"))) & \"\"","v":""},null,null,{"$f":"IF(FS$2=\"\",\"\",INDIRECT(ADDRESS($I19,COLUMN(CCR_1!$J$1)+FS$17-1,,,\"CFR_1\"))) & \"\"","v":""},null,null,{"$f":"IF(FV$2=\"\",\"\",INDIRECT(ADDRESS($I19,COLUMN(CCR_1!$J$1)+FV$17-1,,,\"CFR_1\"))) & \"\"","v":""},null,null,{"$f":"IF(FY$2=\"\",\"\",INDIRECT(ADDRESS($I19,COLUMN(CCR_1!$J$1)+FY$17-1,,,\"CFR_1\"))) & \"\"","v":""},null,null,{"$f":"IF(GB$2=\"\",\"\",INDIRECT(ADDRESS($I19,COLUMN(CCR_1!$J$1)+GB$17-1,,,\"CFR_1\"))) & \"\"","v":""},null,null,{"$f":"IF(GE$2=\"\",\"\",INDIRECT(ADDRESS($I19,COLUMN(CCR_1!$J$1)+GE$17-1,,,\"CFR_1\"))) & \"\"","v":""},null,null,{"$f":"IF(GH$2=\"\",\"\",INDIRECT(ADDRESS($I19,COLUMN(CCR_1!$J$1)+GH$17-1,,,\"CFR_1\"))) & \"\"","v":""},null,null,{"$f":"IF(GK$2=\"\",\"\",INDIRECT(ADDRESS($I19,COLUMN(CCR_1!$J$1)+GK$17-1,,,\"CFR_1\"))) & \"\"","v":""},null,null,{"$f":"IF(GN$2=\"\",\"\",INDIRECT(ADDRESS($I19,COLUMN(CCR_1!$J$1)+GN$17-1,,,\"CFR_1\"))) & \"\"","v":""},null,null,{"$f":"IF(GQ$2=\"\",\"\",INDIRECT(ADDRESS($I19,COLUMN(CCR_1!$J$1)+GQ$17-1,,,\"CFR_1\"))) & \"\"","v":""},null,null,{"$f":"IF(GT$2=\"\",\"\",INDIRECT(ADDRESS($I19,COLUMN(CCR_1!$J$1)+GT$17-1,,,\"CFR_1\"))) & \"\"","v":""},null,null,{"$f":"IF(GW$2=\"\",\"\",INDIRECT(ADDRESS($I19,COLUMN(CCR_1!$J$1)+GW$17-1,,,\"CFR_1\"))) & \"\"","v":""},null,null,{"$f":"IF(GZ$2=\"\",\"\",INDIRECT(ADDRESS($I19,COLUMN(CCR_1!$J$1)+GZ$17-1,,,\"CFR_1\"))) & \"\"","v":""},null,null,{"$f":"IF(HC$2=\"\",\"\",INDIRECT(ADDRESS($I19,COLUMN(CCR_1!$J$1)+HC$17-1,,,\"CFR_1\"))) & \"\"","v":""},null,null,{"$f":"IF(HF$2=\"\",\"\",INDIRECT(ADDRESS($I19,COLUMN(CCR_1!$J$1)+HF$17-1,,,\"CFR_1\"))) & \"\"","v":""},null,null,{"$f":"IF(HI$2=\"\",\"\",INDIRECT(ADDRESS($I19,COLUMN(CCR_1!$J$1)+HI$17-1,,,\"CFR_1\"))) & \"\"","v":""},null,null,{"$f":"IF(HL$2=\"\",\"\",INDIRECT(ADDRESS($I19,COLUMN(CCR_1!$J$1)+HL$17-1,,,\"CFR_1\"))) & \"\"","v":""},null,null,{"$f":"IF(HO$2=\"\",\"\",INDIRECT(ADDRESS($I19,COLUMN(CCR_1!$J$1)+HO$17-1,,,\"CFR_1\"))) & \"\"","v":""}]
[null,"PROGRAM/SITE NAME",null,null,null,null,null,null,{"$f":"ROW(CCR_1!$A$19)","v":19},null,null,null,{"$f":"IF(M$2=\"\",\"\",INDIRECT(ADDRESS($I20,COLUMN(CCR_1!$J$1)+M$17-1,,,\"CCR_1\"))) & \"\"","v":""},null,null,{"$f":"IF(P$2=\"\",\"\",INDIRECT(ADDRESS($I20,COLUMN(CCR_1!$J$1)+P$17-1,,,\"CCR_1\"))) & \"\"","v":""},null,null,{"$f":"IF(S$2=\"\",\"\",INDIRECT(ADDRESS($I20,COLUMN(CCR_1!$J$1)+S$17-1,,,\"CCR_1\"))) & \"\"","v":""},null,null,{"$f":"IF(V$2=\"\",\"\",INDIRECT(ADDRESS($I20,COLUMN(CCR_1!$J$1)+V$17-1,,,\"CCR_1\"))) & \"\"","v":""},null,null,{"$f":"IF(Y$2=\"\",\"\",INDIRECT(ADDRESS($I20,COLUMN(CCR_1!$J$1)+Y$17-1,,,\"CCR_1\"))) & \"\"","v":""},null,null,{"$f":"IF(AB$2=\"\",\"\",INDIRECT(ADDRESS($I20,COLUMN(CCR_1!$J$1)+AB$17-1,,,\"CCR_1\"))) & \"\"","v":""},null,null,{"$f":"IF(AE$2=\"\",\"\",INDIRECT(ADDRESS($I20,COLUMN(CCR_1!$J$1)+AE$17-1,,,\"CCR_1\"))) & \"\"","v":""},null,null,{"$f":"IF(AH$2=\"\",\"\",INDIRECT(ADDRESS($I20,COLUMN(CCR_1!$J$1)+AH$17-1,,,\"CCR_1\"))) & \"\"","v":""},null,null,{"$f":"IF(AK$2=\"\",\"\",INDIRECT(ADDRESS($I20,COLUMN(CCR_1!$J$1)+AK$17-1,,,\"CCR_1\"))) & \"\"","v":""},null,null,{"$f":"IF(AN$2=\"\",\"\",INDIRECT(ADDRESS($I20,COLUMN(CCR_1!$J$1)+AN$17-1,,,\"CCR_1\"))) & \"\"","v":""},null,null,{"$f":"IF(AQ$2=\"\",\"\",INDIRECT(ADDRESS($I20,COLUMN(CCR_1!$J$1)+AQ$17-1,,,\"CCR_1\"))) & \"\"","v":""},null,null,{"$f":"IF(AT$2=\"\",\"\",INDIRECT(ADDRESS($I20,COLUMN(CCR_1!$J$1)+AT$17-1,,,\"CCR_1\"))) & \"\"","v":""},null,null,{"$f":"IF(AW$2=\"\",\"\",INDIRECT(ADDRESS($I20,COLUMN(CCR_1!$J$1)+AW$17-1,,,\"CCR_1\"))) & \"\"","v":""},null,null,{"$f":"IF(AZ$2=\"\",\"\",INDIRECT(ADDRESS($I20,COLUMN(CCR_1!$J$1)+AZ$17-1,,,\"CCR_1\"))) & \"\"","v":""},null,null,{"$f":"IF(BC$2=\"\",\"\",INDIRECT(ADDRESS($I20,COLUMN(CCR_1!$J$1)+BC$17-1,,,\"CCR_1\"))) & \"\"","v":""},null,null,{"$f":"IF(BF$2=\"\",\"\",INDIRECT(ADDRESS($I20,COLUMN(CCR_1!$J$1)+BF$17-1,,,\"CCR_1\"))) & \"\"","v":""},null,null,{"$f":"IF(BI$2=\"\",\"\",INDIRECT(ADDRESS($I20,COLUMN(CCR_1!$J$1)+BI$17-1,,,\"CCR_1\"))) & \"\"","v":""},null,null,{"$f":"IF(BL$2=\"\",\"\",INDIRECT(ADDRESS($I20,COLUMN(CCR_1!$J$1)+BL$17-1,,,\"CCR_1\"))) & \"\"","v":""},null,null,{"$f":"IF(BO$2=\"\",\"\",INDIRECT(ADDRESS($I20,COLUMN(CCR_1!$J$1)+BO$17-1,,,\"CCR_1\"))) & \"\"","v":""},null,null,{"$f":"IF(BR$2=\"\",\"\",INDIRECT(ADDRESS($I20,COLUMN(CCR_1!$J$1)+BR$17-1,,,\"CCR_1\"))) & \"\"","v":""},null,null,{"$f":"IF(BU$2=\"\",\"\",INDIRECT(ADDRESS($I20,COLUMN(CCR_1!$J$1)+BU$17-1,,,\"CCR_1\"))) & \"\"","v":""},null,null,{"$f":"IF(BX$2=\"\",\"\",INDIRECT(ADDRESS($I20,COLUMN(CCR_1!$J$1)+BX$17-1,,,\"CCR_1\"))) & \"\"","v":""},null,null,{"$f":"IF(CA$2=\"\",\"\",INDIRECT(ADDRESS($I20,COLUMN(CCR_1!$J$1)+CA$17-1,,,\"CCR_1\"))) & \"\"","v":""},null,null,{"$f":"IF(CD$2=\"\",\"\",INDIRECT(ADDRESS($I20,COLUMN(CCR_1!$J$1)+CD$17-1,,,\"CCR_1\"))) & \"\"","v":""},null,null,{"$f":"IF(CG$2=\"\",\"\",INDIRECT(ADDRESS($I20,COLUMN(CCR_1!$J$1)+CG$17-1,,,\"CCR_1\"))) & \"\"","v":""},null,null,{"$f":"IF(CJ$2=\"\",\"\",INDIRECT(ADDRESS($I20,COLUMN(CCR_1!$J$1)+CJ$17-1,,,\"CCR_1\"))) & \"\"","v":""},null,null,{"$f":"IF(CM$2=\"\",\"\",INDIRECT(ADDRESS($I20,COLUMN(CCR_1!$J$1)+CM$17-1,,,\"CCR_1\"))) & \"\"","v":""},null,null,{"$f":"IF(CP$2=\"\",\"\",INDIRECT(ADDRESS($I20,COLUMN(CCR_1!$J$1)+CP$17-1,,,\"CCR_1\"))) & \"\"","v":""},null,null,{"$f":"IF(CS$2=\"\",\"\",INDIRECT(ADDRESS($I20,COLUMN(CCR_1!$J$1)+CS$17-1,,,\"CCR_1\"))) & \"\"","v":""},null,null,{"$f":"IF(CV$2=\"\",\"\",INDIRECT(ADDRESS($I20,COLUMN(CCR_1!$J$1)+CV$17-1,,,\"CCR_1\"))) & \"\"","v":""},null,null,{"$f":"IF(CY$2=\"\",\"\",INDIRECT(ADDRESS($I20,COLUMN(CCR_1!$J$1)+CY$17-1,,,\"CCR_1\"))) & \"\"","v":""},null,null,{"$f":"IF(DB$2=\"\",\"\",INDIRECT(ADDRESS($I20,COLUMN(CCR_1!$J$1)+DB$17-1,,,\"CCR_1\"))) & \"\"","v":""},null,null,{"$f":"IF(DE$2=\"\",\"\",INDIRECT(ADDRESS($I20,COLUMN(CCR_1!$J$1)+DE$17-1,,,\"CCR_1\"))) & \"\"","v":""},null,null,{"$f":"IF(DH$2=\"\",\"\",INDIRECT(ADDRESS($I20,COLUMN(CCR_1!$J$1)+DH$17-1,,,\"CCR_1\"))) & \"\"","v":""},null,null,{"$f":"IF(DK$2=\"\",\"\",INDIRECT(ADDRESS($I20,COLUMN(CCR_1!$J$1)+DK$17-1,,,\"CCR_1\"))) & \"\"","v":""},null,null,{"$f":"IF(DN$2=\"\",\"\",INDIRECT(ADDRESS($I20,COLUMN(CCR_1!$J$1)+DN$17-1,,,\"CCR_1\"))) & \"\"","v":""},null,null,{"$f":"IF(DQ$2=\"\",\"\",INDIRECT(ADDRESS($I20,COLUMN(CCR_1!$J$1)+DQ$17-1,,,\"CCR_1\"))) & \"\"","v":""},null,null,{"$f":"IF(DT$2=\"\",\"\",INDIRECT(ADDRESS($I20,COLUMN(CCR_1!$J$1)+DT$17-1,,,\"CCR_1\"))) & \"\"","v":""},null,null,{"$f":"IF(DW$2=\"\",\"\",INDIRECT(ADDRESS($I20,COLUMN(CCR_1!$J$1)+DW$17-1,,,\"CCR_1\"))) & \"\"","v":""},null,null,{"$f":"IF(DZ$2=\"\",\"\",INDIRECT(ADDRESS($I20,COLUMN(CCR_1!$J$1)+DZ$17-1,,,\"CFR_1\"))) & \"\"","v":""},null,null,{"$f":"IF(EC$2=\"\",\"\",INDIRECT(ADDRESS($I20,COLUMN(CCR_1!$J$1)+EC$17-1,,,\"CFR_1\"))) & \"\"","v":""},null,null,{"$f":"IF(EF$2=\"\",\"\",INDIRECT(ADDRESS($I20,COLUMN(CCR_1!$J$1)+EF$17-1,,,\"CFR_1\"))) & \"\"","v":""},null,null,{"$f":"IF(EI$2=\"\",\"\",INDIRECT(ADDRESS($I20,COLUMN(CCR_1!$J$1)+EI$17-1,,,\"CFR_1\"))) & \"\"","v":""},null,null,{"$f":"IF(EL$2=\"\",\"\",INDIRECT(ADDRESS($I20,COLUMN(CCR_1!$J$1)+EL$17-1,,,\"CFR_1\"))) & \"\"","v":""},null,null,{"$f":"IF(EO$2=\"\",\"\",INDIRECT(ADDRESS($I20,COLUMN(CCR_1!$J$1)+EO$17-1,,,\"CFR_1\"))) & \"\"","v":""},null,null,{"$f":"IF(ER$2=\"\",\"\",INDIRECT(ADDRESS($I20,COLUMN(CCR_1!$J$1)+ER$17-1,,,\"CFR_1\"))) & \"\"","v":""},null,null,{"$f":"IF(EU$2=\"\",\"\",INDIRECT(ADDRESS($I20,COLUMN(CCR_1!$J$1)+EU$17-1,,,\"CFR_1\"))) & \"\"","v":""},null,null,{"$f":"IF(EX$2=\"\",\"\",INDIRECT(ADDRESS($I20,COLUMN(CCR_1!$J$1)+EX$17-1,,,\"CFR_1\"))) & \"\"","v":""},null,null,{"$f":"IF(FA$2=\"\",\"\",INDIRECT(ADDRESS($I20,COLUMN(CCR_1!$J$1)+FA$17-1,,,\"CFR_1\"))) & \"\"","v":""},null,null,{"$f":"IF(FD$2=\"\",\"\",INDIRECT(ADDRESS($I20,COLUMN(CCR_1!$J$1)+FD$17-1,,,\"CFR_1\"))) & \"\"","v":""},null,null,{"$f":"IF(FG$2=\"\",\"\",INDIRECT(ADDRESS($I20,COLUMN(CCR_1!$J$1)+FG$17-1,,,\"CFR_1\"))) & \"\"","v":""},null,null,{"$f":"IF(FJ$2=\"\",\"\",INDIRECT(ADDRESS($I20,COLUMN(CCR_1!$J$1)+FJ$17-1,,,\"CFR_1\"))) & \"\"","v":""},null,null,{"$f":"IF(FM$2=\"\",\"\",INDIRECT(ADDRESS($I20,COLUMN(CCR_1!$J$1)+FM$17-1,,,\"CFR_1\"))) & \"\"","v":""},null,null,{"$f":"IF(FP$2=\"\",\"\",INDIRECT(ADDRESS($I20,COLUMN(CCR_1!$J$1)+FP$17-1,,,\"CFR_1\"))) & \"\"","v":""},null,null,{"$f":"IF(FS$2=\"\",\"\",INDIRECT(ADDRESS($I20,COLUMN(CCR_1!$J$1)+FS$17-1,,,\"CFR_1\"))) & \"\"","v":""},null,null,{"$f":"IF(FV$2=\"\",\"\",INDIRECT(ADDRESS($I20,COLUMN(CCR_1!$J$1)+FV$17-1,,,\"CFR_1\"))) & \"\"","v":""},null,null,{"$f":"IF(FY$2=\"\",\"\",INDIRECT(ADDRESS($I20,COLUMN(CCR_1!$J$1)+FY$17-1,,,\"CFR_1\"))) & \"\"","v":""},null,null,{"$f":"IF(GB$2=\"\",\"\",INDIRECT(ADDRESS($I20,COLUMN(CCR_1!$J$1)+GB$17-1,,,\"CFR_1\"))) & \"\"","v":""},null,null,{"$f":"IF(GE$2=\"\",\"\",INDIRECT(ADDRESS($I20,COLUMN(CCR_1!$J$1)+GE$17-1,,,\"CFR_1\"))) & \"\"","v":""},null,null,{"$f":"IF(GH$2=\"\",\"\",INDIRECT(ADDRESS($I20,COLUMN(CCR_1!$J$1)+GH$17-1,,,\"CFR_1\"))) & \"\"","v":""},null,null,{"$f":"IF(GK$2=\"\",\"\",INDIRECT(ADDRESS($I20,COLUMN(CCR_1!$J$1)+GK$17-1,,,\"CFR_1\"))) & \"\"","v":""},null,null,{"$f":"IF(GN$2=\"\",\"\",INDIRECT(ADDRESS($I20,COLUMN(CCR_1!$J$1)+GN$17-1,,,\"CFR_1\"))) & \"\"","v":""},null,null,{"$f":"IF(GQ$2=\"\",\"\",INDIRECT(ADDRESS($I20,COLUMN(CCR_1!$J$1)+GQ$17-1,,,\"CFR_1\"))) & \"\"","v":""},null,null,{"$f":"IF(GT$2=\"\",\"\",INDIRECT(ADDRESS($I20,COLUMN(CCR_1!$J$1)+GT$17-1,,,\"CFR_1\"))) & \"\"","v":""},null,null,{"$f":"IF(GW$2=\"\",\"\",INDIRECT(ADDRESS($I20,COLUMN(CCR_1!$J$1)+GW$17-1,,,\"CFR_1\"))) & \"\"","v":""},null,null,{"$f":"IF(GZ$2=\"\",\"\",INDIRECT(ADDRESS($I20,COLUMN(CCR_1!$J$1)+GZ$17-1,,,\"CFR_1\"))) & \"\"","v":""},null,null,{"$f":"IF(HC$2=\"\",\"\",INDIRECT(ADDRESS($I20,COLUMN(CCR_1!$J$1)+HC$17-1,,,\"CFR_1\"))) & \"\"","v":""},null,null,{"$f":"IF(HF$2=\"\",\"\",INDIRECT(ADDRESS($I20,COLUMN(CCR_1!$J$1)+HF$17-1,,,\"CFR_1\"))) & \"\"","v":""},null,null,{"$f":"IF(HI$2=\"\",\"\",INDIRECT(ADDRESS($I20,COLUMN(CCR_1!$J$1)+HI$17-1,,,\"CFR_1\"))) & \"\"","v":""},null,null,{"$f":"IF(HL$2=\"\",\"\",INDIRECT(ADDRESS($I20,COLUMN(CCR_1!$J$1)+HL$17-1,,,\"CFR_1\"))) & \"\"","v":""},null,null,{"$f":"IF(HO$2=\"\",\"\",INDIRECT(ADDRESS($I20,COLUMN(CCR_1!$J$1)+HO$17-1,,,\"CFR_1\"))) & \"\"","v":""}]
[null,"PROGRAM/SITE ADDRESS (Line One)",null,null,null,null,null,null,{"$f":"+ROW(CCR_1!$A$20)","v":20},null,null,null,{"$f":"IF(M$2=\"\",\"\",INDIRECT(ADDRESS($I21,COLUMN(CCR_1!$J$1)+M$17-1,,,\"CCR_1\"))) & \"\"","v":""},null,null,{"$f":"IF(P$2=\"\",\"\",INDIRECT(ADDRESS($I21,COLUMN(CCR_1!$J$1)+P$17-1,,,\"CCR_1\"))) & \"\"","v":""},null,null,{"$f":"IF(S$2=\"\",\"\",INDIRECT(ADDRESS($I21,COLUMN(CCR_1!$J$1)+S$17-1,,,\"CCR_1\"))) & \"\"","v":""},null,null,{"$f":"IF(V$2=\"\",\"\",INDIRECT(ADDRESS($I21,COLUMN(CCR_1!$J$1)+V$17-1,,,\"CCR_1\"))) & \"\"","v":""},null,null,{"$f":"IF(Y$2=\"\",\"\",INDIRECT(ADDRESS($I21,COLUMN(CCR_1!$J$1)+Y$17-1,,,\"CCR_1\"))) & \"\"","v":""},null,null,{"$f":"IF(AB$2=\"\",\"\",INDIRECT(ADDRESS($I21,COLUMN(CCR_1!$J$1)+AB$17-1,,,\"CCR_1\"))) & \"\"","v":""},null,null,{"$f":"IF(AE$2=\"\",\"\",INDIRECT(ADDRESS($I21,COLUMN(CCR_1!$J$1)+AE$17-1,,,\"CCR_1\"))) & \"\"","v":""},null,null,{"$f":"IF(AH$2=\"\",\"\",INDIRECT(ADDRESS($I21,COLUMN(CCR_1!$J$1)+AH$17-1,,,\"CCR_1\"))) & \"\"","v":""},null,null,{"$f":"IF(AK$2=\"\",\"\",INDIRECT(ADDRESS($I21,COLUMN(CCR_1!$J$1)+AK$17-1,,,\"CCR_1\"))) & \"\"","v":""},null,null,{"$f":"IF(AN$2=\"\",\"\",INDIRECT(ADDRESS($I21,COLUMN(CCR_1!$J$1)+AN$17-1,,,\"CCR_1\"))) & \"\"","v":""},null,null,{"$f":"IF(AQ$2=\"\",\"\",INDIRECT(ADDRESS($I21,COLUMN(CCR_1!$J$1)+AQ$17-1,,,\"CCR_1\"))) & \"\"","v":""},null,null,{"$f":"IF(AT$2=\"\",\"\",INDIRECT(ADDRESS($I21,COLUMN(CCR_1!$J$1)+AT$17-1,,,\"CCR_1\"))) & \"\"","v":""},null,null,{"$f":"IF(AW$2=\"\",\"\",INDIRECT(ADDRESS($I21,COLUMN(CCR_1!$J$1)+AW$17-1,,,\"CCR_1\"))) & \"\"","v":""},null,null,{"$f":"IF(AZ$2=\"\",\"\",INDIRECT(ADDRESS($I21,COLUMN(CCR_1!$J$1)+AZ$17-1,,,\"CCR_1\"))) & \"\"","v":""},null,null,{"$f":"IF(BC$2=\"\",\"\",INDIRECT(ADDRESS($I21,COLUMN(CCR_1!$J$1)+BC$17-1,,,\"CCR_1\"))) & \"\"","v":""},null,null,{"$f":"IF(BF$2=\"\",\"\",INDIRECT(ADDRESS($I21,COLUMN(CCR_1!$J$1)+BF$17-1,,,\"CCR_1\"))) & \"\"","v":""},null,null,{"$f":"IF(BI$2=\"\",\"\",INDIRECT(ADDRESS($I21,COLUMN(CCR_1!$J$1)+BI$17-1,,,\"CCR_1\"))) & \"\"","v":""},null,null,{"$f":"IF(BL$2=\"\",\"\",INDIRECT(ADDRESS($I21,COLUMN(CCR_1!$J$1)+BL$17-1,,,\"CCR_1\"))) & \"\"","v":""},null,null,{"$f":"IF(BO$2=\"\",\"\",INDIRECT(ADDRESS($I21,COLUMN(CCR_1!$J$1)+BO$17-1,,,\"CCR_1\"))) & \"\"","v":""},null,null,{"$f":"IF(BR$2=\"\",\"\",INDIRECT(ADDRESS($I21,COLUMN(CCR_1!$J$1)+BR$17-1,,,\"CCR_1\"))) & \"\"","v":""},null,null,{"$f":"IF(BU$2=\"\",\"\",INDIRECT(ADDRESS($I21,COLUMN(CCR_1!$J$1)+BU$17-1,,,\"CCR_1\"))) & \"\"","v":""},null,null,{"$f":"IF(BX$2=\"\",\"\",INDIRECT(ADDRESS($I21,COLUMN(CCR_1!$J$1)+BX$17-1,,,\"CCR_1\"))) & \"\"","v":""},null,null,{"$f":"IF(CA$2=\"\",\"\",INDIRECT(ADDRESS($I21,COLUMN(CCR_1!$J$1)+CA$17-1,,,\"CCR_1\"))) & \"\"","v":""},null,null,{"$f":"IF(CD$2=\"\",\"\",INDIRECT(ADDRESS($I21,COLUMN(CCR_1!$J$1)+CD$17-1,,,\"CCR_1\"))) & \"\"","v":""},null,null,{"$f":"IF(CG$2=\"\",\"\",INDIRECT(ADDRESS($I21,COLUMN(CCR_1!$J$1)+CG$17-1,,,\"CCR_1\"))) & \"\"","v":""},null,null,{"$f":"IF(CJ$2=\"\",\"\",INDIRECT(ADDRESS($I21,COLUMN(CCR_1!$J$1)+CJ$17-1,,,\"CCR_1\"))) & \"\"","v":""},null,null,{"$f":"IF(CM$2=\"\",\"\",INDIRECT(ADDRESS($I21,COLUMN(CCR_1!$J$1)+CM$17-1,,,\"CCR_1\"))) & \"\"","v":""},null,null,{"$f":"IF(CP$2=\"\",\"\",INDIRECT(ADDRESS($I21,COLUMN(CCR_1!$J$1)+CP$17-1,,,\"CCR_1\"))) & \"\"","v":""},null,null,{"$f":"IF(CS$2=\"\",\"\",INDIRECT(ADDRESS($I21,COLUMN(CCR_1!$J$1)+CS$17-1,,,\"CCR_1\"))) & \"\"","v":""},null,null,{"$f":"IF(CV$2=\"\",\"\",INDIRECT(ADDRESS($I21,COLUMN(CCR_1!$J$1)+CV$17-1,,,\"CCR_1\"))) & \"\"","v":""},null,null,{"$f":"IF(CY$2=\"\",\"\",INDIRECT(ADDRESS($I21,COLUMN(CCR_1!$J$1)+CY$17-1,,,\"CCR_1\"))) & \"\"","v":""},null,null,{"$f":"IF(DB$2=\"\",\"\",INDIRECT(ADDRESS($I21,COLUMN(CCR_1!$J$1)+DB$17-1,,,\"CCR_1\"))) & \"\"","v":""},null,null,{"$f":"IF(DE$2=\"\",\"\",INDIRECT(ADDRESS($I21,COLUMN(CCR_1!$J$1)+DE$17-1,,,\"CCR_1\"))) & \"\"","v":""},null,null,{"$f":"IF(DH$2=\"\",\"\",INDIRECT(ADDRESS($I21,COLUMN(CCR_1!$J$1)+DH$17-1,,,\"CCR_1\"))) & \"\"","v":""},null,null,{"$f":"IF(DK$2=\"\",\"\",INDIRECT(ADDRESS($I21,COLUMN(CCR_1!$J$1)+DK$17-1,,,\"CCR_1\"))) & \"\"","v":""},null,null,{"$f":"IF(DN$2=\"\",\"\",INDIRECT(ADDRESS($I21,COLUMN(CCR_1!$J$1)+DN$17-1,,,\"CCR_1\"))) & \"\"","v":""},null,null,{"$f":"IF(DQ$2=\"\",\"\",INDIRECT(ADDRESS($I21,COLUMN(CCR_1!$J$1)+DQ$17-1,,,\"CCR_1\"))) & \"\"","v":""},null,null,{"$f":"IF(DT$2=\"\",\"\",INDIRECT(ADDRESS($I21,COLUMN(CCR_1!$J$1)+DT$17-1,,,\"CCR_1\"))) & \"\"","v":""},null,null,{"$f":"IF(DW$2=\"\",\"\",INDIRECT(ADDRESS($I21,COLUMN(CCR_1!$J$1)+DW$17-1,,,\"CCR_1\"))) & \"\"","v":""},null,null,{"$f":"IF(DZ$2=\"\",\"\",INDIRECT(ADDRESS($I21,COLUMN(CCR_1!$J$1)+DZ$17-1,,,\"CFR_1\"))) & \"\"","v":""},null,null,{"$f":"IF(EC$2=\"\",\"\",INDIRECT(ADDRESS($I21,COLUMN(CCR_1!$J$1)+EC$17-1,,,\"CFR_1\"))) & \"\"","v":""},null,null,{"$f":"IF(EF$2=\"\",\"\",INDIRECT(ADDRESS($I21,COLUMN(CCR_1!$J$1)+EF$17-1,,,\"CFR_1\"))) & \"\"","v":""},null,null,{"$f":"IF(EI$2=\"\",\"\",INDIRECT(ADDRESS($I21,COLUMN(CCR_1!$J$1)+EI$17-1,,,\"CFR_1\"))) & \"\"","v":""},null,null,{"$f":"IF(EL$2=\"\",\"\",INDIRECT(ADDRESS($I21,COLUMN(CCR_1!$J$1)+EL$17-1,,,\"CFR_1\"))) & \"\"","v":""},null,null,{"$f":"IF(EO$2=\"\",\"\",INDIRECT(ADDRESS($I21,COLUMN(CCR_1!$J$1)+EO$17-1,,,\"CFR_1\"))) & \"\"","v":""},null,null,{"$f":"IF(ER$2=\"\",\"\",INDIRECT(ADDRESS($I21,COLUMN(CCR_1!$J$1)+ER$17-1,,,\"CFR_1\"))) & \"\"","v":""},null,null,{"$f":"IF(EU$2=\"\",\"\",INDIRECT(ADDRESS($I21,COLUMN(CCR_1!$J$1)+EU$17-1,,,\"CFR_1\"))) & \"\"","v":""},null,null,{"$f":"IF(EX$2=\"\",\"\",INDIRECT(ADDRESS($I21,COLUMN(CCR_1!$J$1)+EX$17-1,,,\"CFR_1\"))) & \"\"","v":""},null,null,{"$f":"IF(FA$2=\"\",\"\",INDIRECT(ADDRESS($I21,COLUMN(CCR_1!$J$1)+FA$17-1,,,\"CFR_1\"))) & \"\"","v":""},null,null,{"$f":"IF(FD$2=\"\",\"\",INDIRECT(ADDRESS($I21,COLUMN(CCR_1!$J$1)+FD$17-1,,,\"CFR_1\"))) & \"\"","v":""},null,null,{"$f":"IF(FG$2=\"\",\"\",INDIRECT(ADDRESS($I21,COLUMN(CCR_1!$J$1)+FG$17-1,,,\"CFR_1\"))) & \"\"","v":""},null,null,{"$f":"IF(FJ$2=\"\",\"\",INDIRECT(ADDRESS($I21,COLUMN(CCR_1!$J$1)+FJ$17-1,,,\"CFR_1\"))) & \"\"","v":""},null,null,{"$f":"IF(FM$2=\"\",\"\",INDIRECT(ADDRESS($I21,COLUMN(CCR_1!$J$1)+FM$17-1,,,\"CFR_1\"))) & \"\"","v":""},null,null,{"$f":"IF(FP$2=\"\",\"\",INDIRECT(ADDRESS($I21,COLUMN(CCR_1!$J$1)+FP$17-1,,,\"CFR_1\"))) & \"\"","v":""},null,null,{"$f":"IF(FS$2=\"\",\"\",INDIRECT(ADDRESS($I21,COLUMN(CCR_1!$J$1)+FS$17-1,,,\"CFR_1\"))) & \"\"","v":""},null,null,{"$f":"IF(FV$2=\"\",\"\",INDIRECT(ADDRESS($I21,COLUMN(CCR_1!$J$1)+FV$17-1,,,\"CFR_1\"))) & \"\"","v":""},null,null,{"$f":"IF(FY$2=\"\",\"\",INDIRECT(ADDRESS($I21,COLUMN(CCR_1!$J$1)+FY$17-1,,,\"CFR_1\"))) & \"\"","v":""},null,null,{"$f":"IF(GB$2=\"\",\"\",INDIRECT(ADDRESS($I21,COLUMN(CCR_1!$J$1)+GB$17-1,,,\"CFR_1\"))) & \"\"","v":""},null,null,{"$f":"IF(GE$2=\"\",\"\",INDIRECT(ADDRESS($I21,COLUMN(CCR_1!$J$1)+GE$17-1,,,\"CFR_1\"))) & \"\"","v":""},null,null,{"$f":"IF(GH$2=\"\",\"\",INDIRECT(ADDRESS($I21,COLUMN(CCR_1!$J$1)+GH$17-1,,,\"CFR_1\"))) & \"\"","v":""},null,null,{"$f":"IF(GK$2=\"\",\"\",INDIRECT(ADDRESS($I21,COLUMN(CCR_1!$J$1)+GK$17-1,,,\"CFR_1\"))) & \"\"","v":""},null,null,{"$f":"IF(GN$2=\"\",\"\",INDIRECT(ADDRESS($I21,COLUMN(CCR_1!$J$1)+GN$17-1,,,\"CFR_1\"))) & \"\"","v":""},null,null,{"$f":"IF(GQ$2=\"\",\"\",INDIRECT(ADDRESS($I21,COLUMN(CCR_1!$J$1)+GQ$17-1,,,\"CFR_1\"))) & \"\"","v":""},null,null,{"$f":"IF(GT$2=\"\",\"\",INDIRECT(ADDRESS($I21,COLUMN(CCR_1!$J$1)+GT$17-1,,,\"CFR_1\"))) & \"\"","v":""},null,null,{"$f":"IF(GW$2=\"\",\"\",INDIRECT(ADDRESS($I21,COLUMN(CCR_1!$J$1)+GW$17-1,,,\"CFR_1\"))) & \"\"","v":""},null,null,{"$f":"IF(GZ$2=\"\",\"\",INDIRECT(ADDRESS($I21,COLUMN(CCR_1!$J$1)+GZ$17-1,,,\"CFR_1\"))) & \"\"","v":""},null,null,{"$f":"IF(HC$2=\"\",\"\",INDIRECT(ADDRESS($I21,COLUMN(CCR_1!$J$1)+HC$17-1,,,\"CFR_1\"))) & \"\"","v":""},null,null,{"$f":"IF(HF$2=\"\",\"\",INDIRECT(ADDRESS($I21,COLUMN(CCR_1!$J$1)+HF$17-1,,,\"CFR_1\"))) & \"\"","v":""},null,null,{"$f":"IF(HI$2=\"\",\"\",INDIRECT(ADDRESS($I21,COLUMN(CCR_1!$J$1)+HI$17-1,,,\"CFR_1\"))) & \"\"","v":""},null,null,{"$f":"IF(HL$2=\"\",\"\",INDIRECT(ADDRESS($I21,COLUMN(CCR_1!$J$1)+HL$17-1,,,\"CFR_1\"))) & \"\"","v":""},null,null,{"$f":"IF(HO$2=\"\",\"\",INDIRECT(ADDRESS($I21,COLUMN(CCR_1!$J$1)+HO$17-1,,,\"CFR_1\"))) & \"\"","v":""}]
[null,"PROGRAM/SITE ADDRESS (Line Two)",null,null,null,null,null,null,{"$f":"ROW(CCR_1!$A$21)","v":21},null,null,null,{"$f":"IF(M$2=\"\",\"\",INDIRECT(ADDRESS($I22,COLUMN(CCR_1!$J$1)+M$17-1,,,\"CCR_1\"))) & \"\"","v":""},null,null,{"$f":"IF(P$2=\"\",\"\",INDIRECT(ADDRESS($I22,COLUMN(CCR_1!$J$1)+P$17-1,,,\"CCR_1\"))) & \"\"","v":""},null,null,{"$f":"IF(S$2=\"\",\"\",INDIRECT(ADDRESS($I22,COLUMN(CCR_1!$J$1)+S$17-1,,,\"CCR_1\"))) & \"\"","v":""},null,null,{"$f":"IF(V$2=\"\",\"\",INDIRECT(ADDRESS($I22,COLUMN(CCR_1!$J$1)+V$17-1,,,\"CCR_1\"))) & \"\"","v":""},null,null,{"$f":"IF(Y$2=\"\",\"\",INDIRECT(ADDRESS($I22,COLUMN(CCR_1!$J$1)+Y$17-1,,,\"CCR_1\"))) & \"\"","v":""},null,null,{"$f":"IF(AB$2=\"\",\"\",INDIRECT(ADDRESS($I22,COLUMN(CCR_1!$J$1)+AB$17-1,,,\"CCR_1\"))) & \"\"","v":""},null,null,{"$f":"IF(AE$2=\"\",\"\",INDIRECT(ADDRESS($I22,COLUMN(CCR_1!$J$1)+AE$17-1,,,\"CCR_1\"))) & \"\"","v":""},null,null,{"$f":"IF(AH$2=\"\",\"\",INDIRECT(ADDRESS($I22,COLUMN(CCR_1!$J$1)+AH$17-1,,,\"CCR_1\"))) & \"\"","v":""},null,null,{"$f":"IF(AK$2=\"\",\"\",INDIRECT(ADDRESS($I22,COLUMN(CCR_1!$J$1)+AK$17-1,,,\"CCR_1\"))) & \"\"","v":""},null,null,{"$f":"IF(AN$2=\"\",\"\",INDIRECT(ADDRESS($I22,COLUMN(CCR_1!$J$1)+AN$17-1,,,\"CCR_1\"))) & \"\"","v":""},null,null,{"$f":"IF(AQ$2=\"\",\"\",INDIRECT(ADDRESS($I22,COLUMN(CCR_1!$J$1)+AQ$17-1,,,\"CCR_1\"))) & \"\"","v":""},null,null,{"$f":"IF(AT$2=\"\",\"\",INDIRECT(ADDRESS($I22,COLUMN(CCR_1!$J$1)+AT$17-1,,,\"CCR_1\"))) & \"\"","v":""},null,null,{"$f":"IF(AW$2=\"\",\"\",INDIRECT(ADDRESS($I22,COLUMN(CCR_1!$J$1)+AW$17-1,,,\"CCR_1\"))) & \"\"","v":""},null,null,{"$f":"IF(AZ$2=\"\",\"\",INDIRECT(ADDRESS($I22,COLUMN(CCR_1!$J$1)+AZ$17-1,,,\"CCR_1\"))) & \"\"","v":""},null,null,{"$f":"IF(BC$2=\"\",\"\",INDIRECT(ADDRESS($I22,COLUMN(CCR_1!$J$1)+BC$17-1,,,\"CCR_1\"))) & \"\"","v":""},null,null,{"$f":"IF(BF$2=\"\",\"\",INDIRECT(ADDRESS($I22,COLUMN(CCR_1!$J$1)+BF$17-1,,,\"CCR_1\"))) & \"\"","v":""},null,null,{"$f":"IF(BI$2=\"\",\"\",INDIRECT(ADDRESS($I22,COLUMN(CCR_1!$J$1)+BI$17-1,,,\"CCR_1\"))) & \"\"","v":""},null,null,{"$f":"IF(BL$2=\"\",\"\",INDIRECT(ADDRESS($I22,COLUMN(CCR_1!$J$1)+BL$17-1,,,\"CCR_1\"))) & \"\"","v":""},null,null,{"$f":"IF(BO$2=\"\",\"\",INDIRECT(ADDRESS($I22,COLUMN(CCR_1!$J$1)+BO$17-1,,,\"CCR_1\"))) & \"\"","v":""},null,null,{"$f":"IF(BR$2=\"\",\"\",INDIRECT(ADDRESS($I22,COLUMN(CCR_1!$J$1)+BR$17-1,,,\"CCR_1\"))) & \"\"","v":""},null,null,{"$f":"IF(BU$2=\"\",\"\",INDIRECT(ADDRESS($I22,COLUMN(CCR_1!$J$1)+BU$17-1,,,\"CCR_1\"))) & \"\"","v":""},null,null,{"$f":"IF(BX$2=\"\",\"\",INDIRECT(ADDRESS($I22,COLUMN(CCR_1!$J$1)+BX$17-1,,,\"CCR_1\"))) & \"\"","v":""},null,null,{"$f":"IF(CA$2=\"\",\"\",INDIRECT(ADDRESS($I22,COLUMN(CCR_1!$J$1)+CA$17-1,,,\"CCR_1\"))) & \"\"","v":""},null,null,{"$f":"IF(CD$2=\"\",\"\",INDIRECT(ADDRESS($I22,COLUMN(CCR_1!$J$1)+CD$17-1,,,\"CCR_1\"))) & \"\"","v":""},null,null,{"$f":"IF(CG$2=\"\",\"\",INDIRECT(ADDRESS($I22,COLUMN(CCR_1!$J$1)+CG$17-1,,,\"CCR_1\"))) & \"\"","v":""},null,null,{"$f":"IF(CJ$2=\"\",\"\",INDIRECT(ADDRESS($I22,COLUMN(CCR_1!$J$1)+CJ$17-1,,,\"CCR_1\"))) & \"\"","v":""},null,null,{"$f":"IF(CM$2=\"\",\"\",INDIRECT(ADDRESS($I22,COLUMN(CCR_1!$J$1)+CM$17-1,,,\"CCR_1\"))) & \"\"","v":""},null,null,{"$f":"IF(CP$2=\"\",\"\",INDIRECT(ADDRESS($I22,COLUMN(CCR_1!$J$1)+CP$17-1,,,\"CCR_1\"))) & \"\"","v":""},null,null,{"$f":"IF(CS$2=\"\",\"\",INDIRECT(ADDRESS($I22,COLUMN(CCR_1!$J$1)+CS$17-1,,,\"CCR_1\"))) & \"\"","v":""},null,null,{"$f":"IF(CV$2=\"\",\"\",INDIRECT(ADDRESS($I22,COLUMN(CCR_1!$J$1)+CV$17-1,,,\"CCR_1\"))) & \"\"","v":""},null,null,{"$f":"IF(CY$2=\"\",\"\",INDIRECT(ADDRESS($I22,COLUMN(CCR_1!$J$1)+CY$17-1,,,\"CCR_1\"))) & \"\"","v":""},null,null,{"$f":"IF(DB$2=\"\",\"\",INDIRECT(ADDRESS($I22,COLUMN(CCR_1!$J$1)+DB$17-1,,,\"CCR_1\"))) & \"\"","v":""},null,null,{"$f":"IF(DE$2=\"\",\"\",INDIRECT(ADDRESS($I22,COLUMN(CCR_1!$J$1)+DE$17-1,,,\"CCR_1\"))) & \"\"","v":""},null,null,{"$f":"IF(DH$2=\"\",\"\",INDIRECT(ADDRESS($I22,COLUMN(CCR_1!$J$1)+DH$17-1,,,\"CCR_1\"))) & \"\"","v":""},null,null,{"$f":"IF(DK$2=\"\",\"\",INDIRECT(ADDRESS($I22,COLUMN(CCR_1!$J$1)+DK$17-1,,,\"CCR_1\"))) & \"\"","v":""},null,null,{"$f":"IF(DN$2=\"\",\"\",INDIRECT(ADDRESS($I22,COLUMN(CCR_1!$J$1)+DN$17-1,,,\"CCR_1\"))) & \"\"","v":""},null,null,{"$f":"IF(DQ$2=\"\",\"\",INDIRECT(ADDRESS($I22,COLUMN(CCR_1!$J$1)+DQ$17-1,,,\"CCR_1\"))) & \"\"","v":""},null,null,{"$f":"IF(DT$2=\"\",\"\",INDIRECT(ADDRESS($I22,COLUMN(CCR_1!$J$1)+DT$17-1,,,\"CCR_1\"))) & \"\"","v":""},null,null,{"$f":"IF(DW$2=\"\",\"\",INDIRECT(ADDRESS($I22,COLUMN(CCR_1!$J$1)+DW$17-1,,,\"CCR_1\"))) & \"\"","v":""},null,null,{"$f":"IF(DZ$2=\"\",\"\",INDIRECT(ADDRESS($I22,COLUMN(CCR_1!$J$1)+DZ$17-1,,,\"CFR_1\"))) & \"\"","v":""},null,null,{"$f":"IF(EC$2=\"\",\"\",INDIRECT(ADDRESS($I22,COLUMN(CCR_1!$J$1)+EC$17-1,,,\"CFR_1\"))) & \"\"","v":""},null,null,{"$f":"IF(EF$2=\"\",\"\",INDIRECT(ADDRESS($I22,COLUMN(CCR_1!$J$1)+EF$17-1,,,\"CFR_1\"))) & \"\"","v":""},null,null,{"$f":"IF(EI$2=\"\",\"\",INDIRECT(ADDRESS($I22,COLUMN(CCR_1!$J$1)+EI$17-1,,,\"CFR_1\"))) & \"\"","v":""},null,null,{"$f":"IF(EL$2=\"\",\"\",INDIRECT(ADDRESS($I22,COLUMN(CCR_1!$J$1)+EL$17-1,,,\"CFR_1\"))) & \"\"","v":""},null,null,{"$f":"IF(EO$2=\"\",\"\",INDIRECT(ADDRESS($I22,COLUMN(CCR_1!$J$1)+EO$17-1,,,\"CFR_1\"))) & \"\"","v":""},null,null,{"$f":"IF(ER$2=\"\",\"\",INDIRECT(ADDRESS($I22,COLUMN(CCR_1!$J$1)+ER$17-1,,,\"CFR_1\"))) & \"\"","v":""},null,null,{"$f":"IF(EU$2=\"\",\"\",INDIRECT(ADDRESS($I22,COLUMN(CCR_1!$J$1)+EU$17-1,,,\"CFR_1\"))) & \"\"","v":""},null,null,{"$f":"IF(EX$2=\"\",\"\",INDIRECT(ADDRESS($I22,COLUMN(CCR_1!$J$1)+EX$17-1,,,\"CFR_1\"))) & \"\"","v":""},null,null,{"$f":"IF(FA$2=\"\",\"\",INDIRECT(ADDRESS($I22,COLUMN(CCR_1!$J$1)+FA$17-1,,,\"CFR_1\"))) & \"\"","v":""},null,null,{"$f":"IF(FD$2=\"\",\"\",INDIRECT(ADDRESS($I22,COLUMN(CCR_1!$J$1)+FD$17-1,,,\"CFR_1\"))) & \"\"","v":""},null,null,{"$f":"IF(FG$2=\"\",\"\",INDIRECT(ADDRESS($I22,COLUMN(CCR_1!$J$1)+FG$17-1,,,\"CFR_1\"))) & \"\"","v":""},null,null,{"$f":"IF(FJ$2=\"\",\"\",INDIRECT(ADDRESS($I22,COLUMN(CCR_1!$J$1)+FJ$17-1,,,\"CFR_1\"))) & \"\"","v":""},null,null,{"$f":"IF(FM$2=\"\",\"\",INDIRECT(ADDRESS($I22,COLUMN(CCR_1!$J$1)+FM$17-1,,,\"CFR_1\"))) & \"\"","v":""},null,null,{"$f":"IF(FP$2=\"\",\"\",INDIRECT(ADDRESS($I22,COLUMN(CCR_1!$J$1)+FP$17-1,,,\"CFR_1\"))) & \"\"","v":""},null,null,{"$f":"IF(FS$2=\"\",\"\",INDIRECT(ADDRESS($I22,COLUMN(CCR_1!$J$1)+FS$17-1,,,\"CFR_1\"))) & \"\"","v":""},null,null,{"$f":"IF(FV$2=\"\",\"\",INDIRECT(ADDRESS($I22,COLUMN(CCR_1!$J$1)+FV$17-1,,,\"CFR_1\"))) & \"\"","v":""},null,null,{"$f":"IF(FY$2=\"\",\"\",INDIRECT(ADDRESS($I22,COLUMN(CCR_1!$J$1)+FY$17-1,,,\"CFR_1\"))) & \"\"","v":""},null,null,{"$f":"IF(GB$2=\"\",\"\",INDIRECT(ADDRESS($I22,COLUMN(CCR_1!$J$1)+GB$17-1,,,\"CFR_1\"))) & \"\"","v":""},null,null,{"$f":"IF(GE$2=\"\",\"\",INDIRECT(ADDRESS($I22,COLUMN(CCR_1!$J$1)+GE$17-1,,,\"CFR_1\"))) & \"\"","v":""},null,null,{"$f":"IF(GH$2=\"\",\"\",INDIRECT(ADDRESS($I22,COLUMN(CCR_1!$J$1)+GH$17-1,,,\"CFR_1\"))) & \"\"","v":""},null,null,{"$f":"IF(GK$2=\"\",\"\",INDIRECT(ADDRESS($I22,COLUMN(CCR_1!$J$1)+GK$17-1,,,\"CFR_1\"))) & \"\"","v":""},null,null,{"$f":"IF(GN$2=\"\",\"\",INDIRECT(ADDRESS($I22,COLUMN(CCR_1!$J$1)+GN$17-1,,,\"CFR_1\"))) & \"\"","v":""},null,null,{"$f":"IF(GQ$2=\"\",\"\",INDIRECT(ADDRESS($I22,COLUMN(CCR_1!$J$1)+GQ$17-1,,,\"CFR_1\"))) & \"\"","v":""},null,null,{"$f":"IF(GT$2=\"\",\"\",INDIRECT(ADDRESS($I22,COLUMN(CCR_1!$J$1)+GT$17-1,,,\"CFR_1\"))) & \"\"","v":""},null,null,{"$f":"IF(GW$2=\"\",\"\",INDIRECT(ADDRESS($I22,COLUMN(CCR_1!$J$1)+GW$17-1,,,\"CFR_1\"))) & \"\"","v":""},null,null,{"$f":"IF(GZ$2=\"\",\"\",INDIRECT(ADDRESS($I22,COLUMN(CCR_1!$J$1)+GZ$17-1,,,\"CFR_1\"))) & \"\"","v":""},null,null,{"$f":"IF(HC$2=\"\",\"\",INDIRECT(ADDRESS($I22,COLUMN(CCR_1!$J$1)+HC$17-1,,,\"CFR_1\"))) & \"\"","v":""},null,null,{"$f":"IF(HF$2=\"\",\"\",INDIRECT(ADDRESS($I22,COLUMN(CCR_1!$J$1)+HF$17-1,,,\"CFR_1\"))) & \"\"","v":""},null,null,{"$f":"IF(HI$2=\"\",\"\",INDIRECT(ADDRESS($I22,COLUMN(CCR_1!$J$1)+HI$17-1,,,\"CFR_1\"))) & \"\"","v":""},null,null,{"$f":"IF(HL$2=\"\",\"\",INDIRECT(ADDRESS($I22,COLUMN(CCR_1!$J$1)+HL$17-1,,,\"CFR_1\"))) & \"\"","v":""},null,null,{"$f":"IF(HO$2=\"\",\"\",INDIRECT(ADDRESS($I22,COLUMN(CCR_1!$J$1)+HO$17-1,,,\"CFR_1\"))) & \"\"","v":""}]
[null,"COUNTY CODE",null,null,null,null,null,null,{"$f":"ROW(CCR_1!$A$22)","v":22},null,null,null,{"$f":"IF(M$2=\"\",\"\",INDIRECT(ADDRESS($I23,COLUMN(CCR_1!$J$1)+M$17-1,,,\"CCR_1\"))) & \"\"","v":""},null,null,{"$f":"IF(P$2=\"\",\"\",INDIRECT(ADDRESS($I23,COLUMN(CCR_1!$J$1)+P$17-1,,,\"CCR_1\"))) & \"\"","v":""},null,null,{"$f":"IF(S$2=\"\",\"\",INDIRECT(ADDRESS($I23,COLUMN(CCR_1!$J$1)+S$17-1,,,\"CCR_1\"))) & \"\"","v":""},null,null,{"$f":"IF(V$2=\"\",\"\",INDIRECT(ADDRESS($I23,COLUMN(CCR_1!$J$1)+V$17-1,,,\"CCR_1\"))) & \"\"","v":""},null,null,{"$f":"IF(Y$2=\"\",\"\",INDIRECT(ADDRESS($I23,COLUMN(CCR_1!$J$1)+Y$17-1,,,\"CCR_1\"))) & \"\"","v":""},null,null,{"$f":"IF(AB$2=\"\",\"\",INDIRECT(ADDRESS($I23,COLUMN(CCR_1!$J$1)+AB$17-1,,,\"CCR_1\"))) & \"\"","v":""},null,null,{"$f":"IF(AE$2=\"\",\"\",INDIRECT(ADDRESS($I23,COLUMN(CCR_1!$J$1)+AE$17-1,,,\"CCR_1\"))) & \"\"","v":""},null,null,{"$f":"IF(AH$2=\"\",\"\",INDIRECT(ADDRESS($I23,COLUMN(CCR_1!$J$1)+AH$17-1,,,\"CCR_1\"))) & \"\"","v":""},null,null,{"$f":"IF(AK$2=\"\",\"\",INDIRECT(ADDRESS($I23,COLUMN(CCR_1!$J$1)+AK$17-1,,,\"CCR_1\"))) & \"\"","v":""},null,null,{"$f":"IF(AN$2=\"\",\"\",INDIRECT(ADDRESS($I23,COLUMN(CCR_1!$J$1)+AN$17-1,,,\"CCR_1\"))) & \"\"","v":""},null,null,{"$f":"IF(AQ$2=\"\",\"\",INDIRECT(ADDRESS($I23,COLUMN(CCR_1!$J$1)+AQ$17-1,,,\"CCR_1\"))) & \"\"","v":""},null,null,{"$f":"IF(AT$2=\"\",\"\",INDIRECT(ADDRESS($I23,COLUMN(CCR_1!$J$1)+AT$17-1,,,\"CCR_1\"))) & \"\"","v":""},null,null,{"$f":"IF(AW$2=\"\",\"\",INDIRECT(ADDRESS($I23,COLUMN(CCR_1!$J$1)+AW$17-1,,,\"CCR_1\"))) & \"\"","v":""},null,null,{"$f":"IF(AZ$2=\"\",\"\",INDIRECT(ADDRESS($I23,COLUMN(CCR_1!$J$1)+AZ$17-1,,,\"CCR_1\"))) & \"\"","v":""},null,null,{"$f":"IF(BC$2=\"\",\"\",INDIRECT(ADDRESS($I23,COLUMN(CCR_1!$J$1)+BC$17-1,,,\"CCR_1\"))) & \"\"","v":""},null,null,{"$f":"IF(BF$2=\"\",\"\",INDIRECT(ADDRESS($I23,COLUMN(CCR_1!$J$1)+BF$17-1,,,\"CCR_1\"))) & \"\"","v":""},null,null,{"$f":"IF(BI$2=\"\",\"\",INDIRECT(ADDRESS($I23,COLUMN(CCR_1!$J$1)+BI$17-1,,,\"CCR_1\"))) & \"\"","v":""},null,null,{"$f":"IF(BL$2=\"\",\"\",INDIRECT(ADDRESS($I23,COLUMN(CCR_1!$J$1)+BL$17-1,,,\"CCR_1\"))) & \"\"","v":""},null,null,{"$f":"IF(BO$2=\"\",\"\",INDIRECT(ADDRESS($I23,COLUMN(CCR_1!$J$1)+BO$17-1,,,\"CCR_1\"))) & \"\"","v":""},null,null,{"$f":"IF(BR$2=\"\",\"\",INDIRECT(ADDRESS($I23,COLUMN(CCR_1!$J$1)+BR$17-1,,,\"CCR_1\"))) & \"\"","v":""},null,null,{"$f":"IF(BU$2=\"\",\"\",INDIRECT(ADDRESS($I23,COLUMN(CCR_1!$J$1)+BU$17-1,,,\"CCR_1\"))) & \"\"","v":""},null,null,{"$f":"IF(BX$2=\"\",\"\",INDIRECT(ADDRESS($I23,COLUMN(CCR_1!$J$1)+BX$17-1,,,\"CCR_1\"))) & \"\"","v":""},null,null,{"$f":"IF(CA$2=\"\",\"\",INDIRECT(ADDRESS($I23,COLUMN(CCR_1!$J$1)+CA$17-1,,,\"CCR_1\"))) & \"\"","v":""},null,null,{"$f":"IF(CD$2=\"\",\"\",INDIRECT(ADDRESS($I23,COLUMN(CCR_1!$J$1)+CD$17-1,,,\"CCR_1\"))) & \"\"","v":""},null,null,{"$f":"IF(CG$2=\"\",\"\",INDIRECT(ADDRESS($I23,COLUMN(CCR_1!$J$1)+CG$17-1,,,\"CCR_1\"))) & \"\"","v":""},null,null,{"$f":"IF(CJ$2=\"\",\"\",INDIRECT(ADDRESS($I23,COLUMN(CCR_1!$J$1)+CJ$17-1,,,\"CCR_1\"))) & \"\"","v":""},null,null,{"$f":"IF(CM$2=\"\",\"\",INDIRECT(ADDRESS($I23,COLUMN(CCR_1!$J$1)+CM$17-1,,,\"CCR_1\"))) & \"\"","v":""},null,null,{"$f":"IF(CP$2=\"\",\"\",INDIRECT(ADDRESS($I23,COLUMN(CCR_1!$J$1)+CP$17-1,,,\"CCR_1\"))) & \"\"","v":""},null,null,{"$f":"IF(CS$2=\"\",\"\",INDIRECT(ADDRESS($I23,COLUMN(CCR_1!$J$1)+CS$17-1,,,\"CCR_1\"))) & \"\"","v":""},null,null,{"$f":"IF(CV$2=\"\",\"\",INDIRECT(ADDRESS($I23,COLUMN(CCR_1!$J$1)+CV$17-1,,,\"CCR_1\"))) & \"\"","v":""},null,null,{"$f":"IF(CY$2=\"\",\"\",INDIRECT(ADDRESS($I23,COLUMN(CCR_1!$J$1)+CY$17-1,,,\"CCR_1\"))) & \"\"","v":""},null,null,{"$f":"IF(DB$2=\"\",\"\",INDIRECT(ADDRESS($I23,COLUMN(CCR_1!$J$1)+DB$17-1,,,\"CCR_1\"))) & \"\"","v":""},null,null,{"$f":"IF(DE$2=\"\",\"\",INDIRECT(ADDRESS($I23,COLUMN(CCR_1!$J$1)+DE$17-1,,,\"CCR_1\"))) & \"\"","v":""},null,null,{"$f":"IF(DH$2=\"\",\"\",INDIRECT(ADDRESS($I23,COLUMN(CCR_1!$J$1)+DH$17-1,,,\"CCR_1\"))) & \"\"","v":""},null,null,{"$f":"IF(DK$2=\"\",\"\",INDIRECT(ADDRESS($I23,COLUMN(CCR_1!$J$1)+DK$17-1,,,\"CCR_1\"))) & \"\"","v":""},null,null,{"$f":"IF(DN$2=\"\",\"\",INDIRECT(ADDRESS($I23,COLUMN(CCR_1!$J$1)+DN$17-1,,,\"CCR_1\"))) & \"\"","v":""},null,null,{"$f":"IF(DQ$2=\"\",\"\",INDIRECT(ADDRESS($I23,COLUMN(CCR_1!$J$1)+DQ$17-1,,,\"CCR_1\"))) & \"\"","v":""},null,null,{"$f":"IF(DT$2=\"\",\"\",INDIRECT(ADDRESS($I23,COLUMN(CCR_1!$J$1)+DT$17-1,,,\"CCR_1\"))) & \"\"","v":""},null,null,{"$f":"IF(DW$2=\"\",\"\",INDIRECT(ADDRESS($I23,COLUMN(CCR_1!$J$1)+DW$17-1,,,\"CCR_1\"))) & \"\"","v":""},null,null,{"$f":"IF(DZ$2=\"\",\"\",INDIRECT(ADDRESS($I23,COLUMN(CCR_1!$J$1)+DZ$17-1,,,\"CFR_1\"))) & \"\"","v":""},null,null,{"$f":"IF(EC$2=\"\",\"\",INDIRECT(ADDRESS($I23,COLUMN(CCR_1!$J$1)+EC$17-1,,,\"CFR_1\"))) & \"\"","v":""},null,null,{"$f":"IF(EF$2=\"\",\"\",INDIRECT(ADDRESS($I23,COLUMN(CCR_1!$J$1)+EF$17-1,,,\"CFR_1\"))) & \"\"","v":""},null,null,{"$f":"IF(EI$2=\"\",\"\",INDIRECT(ADDRESS($I23,COLUMN(CCR_1!$J$1)+EI$17-1,,,\"CFR_1\"))) & \"\"","v":""},null,null,{"$f":"IF(EL$2=\"\",\"\",INDIRECT(ADDRESS($I23,COLUMN(CCR_1!$J$1)+EL$17-1,,,\"CFR_1\"))) & \"\"","v":""},null,null,{"$f":"IF(EO$2=\"\",\"\",INDIRECT(ADDRESS($I23,COLUMN(CCR_1!$J$1)+EO$17-1,,,\"CFR_1\"))) & \"\"","v":""},null,null,{"$f":"IF(ER$2=\"\",\"\",INDIRECT(ADDRESS($I23,COLUMN(CCR_1!$J$1)+ER$17-1,,,\"CFR_1\"))) & \"\"","v":""},null,null,{"$f":"IF(EU$2=\"\",\"\",INDIRECT(ADDRESS($I23,COLUMN(CCR_1!$J$1)+EU$17-1,,,\"CFR_1\"))) & \"\"","v":""},null,null,{"$f":"IF(EX$2=\"\",\"\",INDIRECT(ADDRESS($I23,COLUMN(CCR_1!$J$1)+EX$17-1,,,\"CFR_1\"))) & \"\"","v":""},null,null,{"$f":"IF(FA$2=\"\",\"\",INDIRECT(ADDRESS($I23,COLUMN(CCR_1!$J$1)+FA$17-1,,,\"CFR_1\"))) & \"\"","v":""},null,null,{"$f":"IF(FD$2=\"\",\"\",INDIRECT(ADDRESS($I23,COLUMN(CCR_1!$J$1)+FD$17-1,,,\"CFR_1\"))) & \"\"","v":""},null,null,{"$f":"IF(FG$2=\"\",\"\",INDIRECT(ADDRESS($I23,COLUMN(CCR_1!$J$1)+FG$17-1,,,\"CFR_1\"))) & \"\"","v":""},null,null,{"$f":"IF(FJ$2=\"\",\"\",INDIRECT(ADDRESS($I23,COLUMN(CCR_1!$J$1)+FJ$17-1,,,\"CFR_1\"))) & \"\"","v":""},null,null,{"$f":"IF(FM$2=\"\",\"\",INDIRECT(ADDRESS($I23,COLUMN(CCR_1!$J$1)+FM$17-1,,,\"CFR_1\"))) & \"\"","v":""},null,null,{"$f":"IF(FP$2=\"\",\"\",INDIRECT(ADDRESS($I23,COLUMN(CCR_1!$J$1)+FP$17-1,,,\"CFR_1\"))) & \"\"","v":""},null,null,{"$f":"IF(FS$2=\"\",\"\",INDIRECT(ADDRESS($I23,COLUMN(CCR_1!$J$1)+FS$17-1,,,\"CFR_1\"))) & \"\"","v":""},null,null,{"$f":"IF(FV$2=\"\",\"\",INDIRECT(ADDRESS($I23,COLUMN(CCR_1!$J$1)+FV$17-1,,,\"CFR_1\"))) & \"\"","v":""},null,null,{"$f":"IF(FY$2=\"\",\"\",INDIRECT(ADDRESS($I23,COLUMN(CCR_1!$J$1)+FY$17-1,,,\"CFR_1\"))) & \"\"","v":""},null,null,{"$f":"IF(GB$2=\"\",\"\",INDIRECT(ADDRESS($I23,COLUMN(CCR_1!$J$1)+GB$17-1,,,\"CFR_1\"))) & \"\"","v":""},null,null,{"$f":"IF(GE$2=\"\",\"\",INDIRECT(ADDRESS($I23,COLUMN(CCR_1!$J$1)+GE$17-1,,,\"CFR_1\"))) & \"\"","v":""},null,null,{"$f":"IF(GH$2=\"\",\"\",INDIRECT(ADDRESS($I23,COLUMN(CCR_1!$J$1)+GH$17-1,,,\"CFR_1\"))) & \"\"","v":""},null,null,{"$f":"IF(GK$2=\"\",\"\",INDIRECT(ADDRESS($I23,COLUMN(CCR_1!$J$1)+GK$17-1,,,\"CFR_1\"))) & \"\"","v":""},null,null,{"$f":"IF(GN$2=\"\",\"\",INDIRECT(ADDRESS($I23,COLUMN(CCR_1!$J$1)+GN$17-1,,,\"CFR_1\"))) & \"\"","v":""},null,null,{"$f":"IF(GQ$2=\"\",\"\",INDIRECT(ADDRESS($I23,COLUMN(CCR_1!$J$1)+GQ$17-1,,,\"CFR_1\"))) & \"\"","v":""},null,null,{"$f":"IF(GT$2=\"\",\"\",INDIRECT(ADDRESS($I23,COLUMN(CCR_1!$J$1)+GT$17-1,,,\"CFR_1\"))) & \"\"","v":""},null,null,{"$f":"IF(GW$2=\"\",\"\",INDIRECT(ADDRESS($I23,COLUMN(CCR_1!$J$1)+GW$17-1,,,\"CFR_1\"))) & \"\"","v":""},null,null,{"$f":"IF(GZ$2=\"\",\"\",INDIRECT(ADDRESS($I23,COLUMN(CCR_1!$J$1)+GZ$17-1,,,\"CFR_1\"))) & \"\"","v":""},null,null,{"$f":"IF(HC$2=\"\",\"\",INDIRECT(ADDRESS($I23,COLUMN(CCR_1!$J$1)+HC$17-1,,,\"CFR_1\"))) & \"\"","v":""},null,null,{"$f":"IF(HF$2=\"\",\"\",INDIRECT(ADDRESS($I23,COLUMN(CCR_1!$J$1)+HF$17-1,,,\"CFR_1\"))) & \"\"","v":""},null,null,{"$f":"IF(HI$2=\"\",\"\",INDIRECT(ADDRESS($I23,COLUMN(CCR_1!$J$1)+HI$17-1,,,\"CFR_1\"))) & \"\"","v":""},null,null,{"$f":"IF(HL$2=\"\",\"\",INDIRECT(ADDRESS($I23,COLUMN(CCR_1!$J$1)+HL$17-1,,,\"CFR_1\"))) & \"\"","v":""},null,null,{"$f":"IF(HO$2=\"\",\"\",INDIRECT(ADDRESS($I23,COLUMN(CCR_1!$J$1)+HO$17-1,,,\"CFR_1\"))) & \"\"","v":""}]
[null,"Total",null,null,{"$f":"+SUM(E$27:E$45)","v":0},{"$f":"+SUM(F$27:F$45)","v":0},{"$f":"+SUM(G$27:G$45)","v":0},{"$f":"+SUM(H$27:H$45)","v":0},null,{"$f":"+SUM(J$27:J$45)","v":0},{"$f":"+SUM(K$27:K$45)","v":0},null,{"$f":"+SUM(M$27:M$45)","v":0},0,0,0,0,0,0,0,0,0,0,0,0,0,0,0,0,0,0,0,0,0,0,0,0,0,0,0,0,0,0,0,0,0,0,0,0,0,0,0,0,0,0,0,0,0,0,0,0,0,0,0,0,0,0,0,0,0,0,0,0,{"$f":"+SUM(BV$27:BV$45)","v":0},0,0,0,0,0,0,0,0,0,0,0,0,0,0,0,0,0,0,0,0,0,0,0,0,0,0,0,0,0,0,0,0,0,0,0,0,0,0,0,0,0,0,0,0,0,0,0,0,0,0,0,0,0,0,0,0,0,0,0,0,0,0,0,{"$f":"+SUM(EH$27:EH$45)","v":0},0,{"$f":"+SUM(EJ$27:EJ$45)","v":0},0,0,0,0,0,0,0,0,0,0,0,0,0,0,0,0,0,0,0,0,0,0,0,0,0,0,0,0,0,0,0,0,0,0,0,0,0,0,0,0,0,0,0,0,0,0,0,0,0,0,0,0,0,0,0,0,0,0,0,0,0,0,0,{"$f":"+SUM(GV$27:GV$45)","v":0},0,{"$f":"+SUM(GX$27:GX$45)","v":0},0,0,0,0,0,0,0,0,0,0,0,0,0,0,0,0,0,0,0]
[null,"Position Title",null,null,"Standard Work Week",null,null,null,null,null,null,null,"Hours Paid","FTE","Amount Paid","Hours Paid","FTE","Amount Paid","Hours Paid","FTE","Amount Paid","Hours Paid","FTE","Amount Paid","Hours Paid","FTE","Amount Paid","Hours Paid","FTE","Amount Paid","Hours Paid","FTE","Amount Paid","Hours Paid","FTE","Amount Paid","Hours Paid","FTE","Amount Paid","Hours Paid","FTE","Amount Paid","Hours Paid","FTE","Amount Paid","Hours Paid","FTE","Amount Paid","Hours Paid","FTE","Amount Paid","Hours Paid","FTE","Amount Paid","Hours Paid","FTE","Amount Paid","Hours Paid","FTE","Amount Paid","Hours Paid","FTE","Amount Paid","Hours Paid","FTE","Amount Paid","Hours Paid","FTE","Amount Paid","Hours Paid","FTE","Amount Paid","Hours Paid","FTE","Amount Paid","Hours Paid","FTE","Amount Paid","Hours Paid","FTE","Amount Paid","Hours Paid","FTE","Amount Paid","Hours Paid","FTE","Amount Paid","Hours Paid","FTE","Amount Paid","Hours Paid","FTE","Amount Paid","Hours Paid","FTE","Amount Paid","Hours Paid","FTE","Amount Paid","Hours Paid","FTE","Amount Paid","Hours Paid","FTE","Amount Paid","Hours Paid","FTE","Amount Paid","Hours Paid","FTE","Amount Paid","Hours Paid","FTE","Amount Paid","Hours Paid","FTE","Amount Paid","Hours Paid","FTE","Amount Paid","Hours Paid","FTE","Amount Paid","Hours Paid","FTE","Amount Paid","Hours Paid","FTE","Amount Paid","Hours Paid","FTE","Amount Paid","Hours Paid","FTE","Amount Paid","Hours Paid","FTE","Amount Paid","Hours Paid","FTE","Amount Paid","Hours Paid","FTE","Amount Paid","Hours Paid","FTE","Amount Paid","Hours Paid","FTE","Amount Paid","Hours Paid","FTE","Amount Paid","Hours Paid","FTE","Amount Paid","Hours Paid","FTE","Amount Paid","Hours Paid","FTE","Amount Paid","Hours Paid","FTE","Amount Paid","Hours Paid","FTE","Amount Paid","Hours Paid","FTE","Amount Paid","Hours Paid","FTE","Amount Paid","Hours Paid","FTE","Amount Paid","Hours Paid","FTE","Amount Paid","Hours Paid","FTE","Amount Paid","Hours Paid","FTE","Amount Paid","Hours Paid","FTE","Amount Paid","Hours Paid","FTE","Amount Paid","Hours Paid","FTE","Amount Paid","Hours Paid","FTE","Amount Paid","Hours Paid","FTE","Amount Paid","Hours Paid","FTE","Amount Paid","Hours Paid","FTE","Amount Paid","Hours Paid","FTE","Amount Paid","Hours Paid","FTE","Amount Paid","Hours Paid","FTE","Amount Paid","Hours Paid","FTE","Amount Paid","Hours Paid","FTE","Amount Paid","Hours Paid","FTE","Amount Paid"]
[null,null,null,null,30,35,37.5,40,null,"Other","Agency Administration"]
[]
[]
[]
[]
[]
[]
[]
[]
[]
[]
[]
[]
[]
[]
[]
[]
[]
[]
[]
["Total \"Hours Paid\", \"FTE\" and \"Amount Paid\" for Positions."]
["* Report Agency Administration in one column on a separate page."]
["Totals are transferred to Schedule CCR-1 Line 14 (Program/Site, Program Administration), or Schedule CCR-3 Line 1 (Agency Administration)."]

{"sheet":"CCR_4A","index":5,"n_rows":44,"n_cols":169,"rows_kept":44,"cut":false,"hidden":false,"merged":[[3,0,3,1],[4,0,4,1],[6,0,6,5],[6,6,6,7],[19,161,19,162],[19,163,19,164],[19,165,19,166],[19,167,19,168],[21,159,22,159],[21,160,22,160],[21,161,22,161],[21,162,22,162],[21,163,22,163],[21,164,22,164],[21,165,22,165],[21,166,22,166],[21,167,22,167],[21,168,22,168],[17,161,17,162],[17,163,17,164],[17,165,17,166],[17,167,17,168],[18,159,18,160],[18,161,18,162],[18,163,18,164],[18,165,18,166],[18,167,18,168],[15,161,15,162],[15,163,15,164],[15,165,15,166],[15,167,15,168],[16,159,16,160],[16,161,16,162],[16,163,16,164],[16,165,16,166],[16,167,16,168],[13,161,13,162],[13,163,13,164],[13,165,13,166],[13,167,13,168],[14,159,14,160],[14,161,14,162],[14,163,14,164],[14,165,14,166],[14,167,14,168],[21,155,22,155],[21,156,22,156],[21,157,22,157],[21,158,22,158],[13,159,13,160],[15,159,15,160],[17,159,17,160],[19,159,19,160],[21,150,22,150],[21,151,22,151],[21,152,22,152],[21,153,22,153],[21,154,22,154],[19,151,19,152],[19,153,19,154],[18,157,18,158],[17,155,17,156],[17,157,17,158],[16,149,16,150],[16,151,16,152],[16,153,16,154],[16,155,16,156],[16,157,16,158],[15,151,15,152],[21,145,22,145],[21,146,22,146],[21,147,22,147],[21,148,22,148],[21,149,22,149],[21,140,22,140],[21,141,22,141],[21,142,22,142],[21,143,22,143],[21,144,22,144],[19,155,19,156],[19,157,19,158],[21,111,22,111],[21,112,22,112],[21,113,22,113],[21,114,22,114],[21,115,22,115],[21,116,22,116],[21,117,22,117],[21,118,22,118],[21,119,22,119],[21,120,22,120],[21,121,22,121],[21,122,22,122],[21,123,22,123],[21,124,22,124],[19,145,19,146],[19,147,19,148],[19,149,19,150],[21,135,22,135],[21,136,22,136],[21,137,22,137],[21,138,22,138],[21,139,22,139],[19,125,19,126],[19,127,19,128],[19,129,19,130],[19,131,19,132],[19,133,19,134],[21,125,22,125],[21,126,22,126],[21,127,22,127],[21,128,22,128],[21,129,22,129],[21,130,22,130],[21,131,22,131],[21,132,22,132],[21,133,22,133],[21,134,22,134],[19,115,19,116],[19,117,19,118],[19,119,19,120],[19,121,19,122],[19,123,19,124],[18,149,18,150],[18,151,18,152],[18,153,18,154],[18,155,18,156],[18,139,18,140],[18,141,18,142],[18,143,18,144],[18,145,18,146],[18,147,18,148],[18,129,18,130],[18,131,18,132],[18,133,18,134],[18,135,18,136],[18,137,18,138],[19,135,19,136],[19,137,19,138],[19,139,19,140],[19,141,19,142],[19,143,19,144],[18,111,18,112],[18,113,18,114],[18,115,18,116],[18,117,18,118],[18,119,18,120],[18,121,18,122],[18,123,18,124],[18,125,18,126],[18,127,18,128],[17,145,17,146],[17,147,17,148],[17,149,17,150],[17,151,17,152],[17,153,17,154],[17,135,17,136],[17,137,17,138],[17,139,17,140],[17,141,17,142],[17,143,17,144],[17,125,17,126],[17,127,17,128],[17,129,17,130],[17,131,17,132],[17,133,17,134],[17,115,17,116],[17,117,17,118],[17,119,17,120],[17,121,17,122],[17,123,17,124],[16,139,16,140],[16,141,16,142],[16,143,16,144],[16,145,16,146],[16,147,16,148],[15,155,15,156],[15,157,15,158],[16,111,16,112],[16,113,16,114],[16,115,16,116],[16,117,16,118],[16,119,16,120],[16,121,16,122],[16,123,16,124],[16,125,16,126],[16,127,16,128],[16,129,16,130],[16,131,16,132],[16,133,16,134],[16,135,16,136],[16,137,16,138],[15,145,15,146],[15,147,15,148],[15,149,15,150],[15,123,15,124],[14,149,14,150],[14,151,14,152],[14,153,14,154],[14,155,14,156],[15,153,15,154],[15,135,15,136],[15,137,15,138],[15,139,15,140],[15,141,15,142],[15,143,15,144],[15,125,15,126],[15,127,15,128],[15,129,15,130],[15,131,15,132],[15,133,15,134],[14,157,14,158],[14,139,14,140],[14,141,14,142],[14,143,14,144],[14,145,14,146],[14,147,14,148],[13,155,13,156],[13,157,13,158],[14,111,14,112],[14,113,14,114],[14,115,14,116],[14,117,14,118],[14,119,14,120],[14,121,14,122],[14,123,14,124],[14,125,14,126],[14,127,14,128],[14,129,14,130],[14,131,14,132],[14,133,14,134],[14,135,14,136],[14,137,14,138],[13,145,13,146],[13,147,13,148],[13,149,13,150],[13,151,13,152],[13,153,13,154],[13,135,13,136],[13,137,13,138],[13,139,13,140],[13,141,13,142],[13,143,13,144],[13,125,13,126],[13,127,13,128],[13,129,13,130],[13,131,13,132],[13,133,13,134],[13,115,13,116],[13,117,13,118],[13,119,13,120],[13,121,13,122],[13,123,13,124],[21,108,22,108],[21,109,22,109],[21,110,22,110],[13,111,13,112],[13,113,13,114],[15,111,15,112],[15,113,15,114],[17,111,17,112],[17,113,17,114],[19,111,19,112],[19,113,19,114],[19,109,19,110],[18,107,18,108],[18,109,18,110],[16,109,16,110],[15,115,15,116],[15,117,15,118],[15,119,15,120],[15,121,15,122],[21,103,22,103],[21,104,22,104],[21,105,22,105],[21,106,22,106],[21,107,22,107],[21,98,22,98],[21,99,22,99],[21,100,22,100],[21,101,22,101],[21,102,22,102],[21,94,22,94],[21,95,22,95],[21,96,22,96],[21,97,22,97],[21,88,22,88],[21,89,22,89],[21,90,22,90],[21,91,22,91],[21,92,22,92],[19,107,19,108],[19,91,19,92],[19,93,19,94],[19,95,19,96],[19,97,19,98],[19,99,19,100],[19,81,19,82],[21,73,22,73],[21,74,22,74],[21,75,22,75],[21,76,22,76],[21,77,22,77],[21,83,22,83],[21,84,22,84],[19,73,19,74],[19,75,19,76],[19,77,19,78],[19,79,19,80],[21,85,22,85],[21,86,22,86],[21,87,22,87],[21,78,22,78],[21,79,22,79],[21,80,22,80],[18,103,18,104],[18,105,18,106],[18,87,18,88],[18,89,18,90],[18,91,18,92],[18,93,18,94],[18,95,18,96],[21,66,22,66],[21,67,22,67],[19,101,19,102],[19,103,19,104],[19,105,19,106],[21,68,22,68],[21,69,22,69],[21,70,22,70],[21,71,22,71],[21,72,22,72],[19,65,19,66],[19,67,19,68],[19,69,19,70],[19,71,19,72],[21,81,22,81],[21,82,22,82],[21,93,22,93],[17,101,17,102],[17,63,17,64],[17,65,17,66],[17,67,17,68],[17,71,17,72],[17,73,17,74],[17,75,17,76],[19,83,19,84],[19,85,19,86],[19,87,19,88],[19,89,19,90],[18,97,18,98],[18,99,18,100],[18,101,18,102],[19,63,19,64],[17,81,17,82],[17,83,17,84],[17,85,17,86],[17,79,17,80],[17,103,17,104],[17,87,17,88],[17,89,17,90],[17,91,17,92],[17,109,17,110],[18,63,18,64],[18,65,18,66],[18,67,18,68],[18,69,18,70],[18,71,18,72],[18,73,18,74],[18,75,18,76],[18,77,18,78],[18,79,18,80],[18,81,18,82],[18,83,18,84],[18,85,18,86],[17,93,17,94],[17,95,17,96],[17,97,17,98],[17,99,17,100],[17,105,17,106],[17,107,17,108],[17,77,17,78],[16,79,16,80],[16,81,16,82],[16,83,16,84],[16,85,16,86],[16,87,16,88],[16,69,16,70],[16,71,16,72],[16,73,16,74],[16,75,16,76],[16,77,16,78],[16,99,16,100],[16,101,16,102],[16,103,16,104],[16,105,16,106],[16,107,16,108],[16,89,16,90],[16,91,16,92],[16,93,16,94],[16,95,16,96],[16,97,16,98],[15,101,15,102],[15,103,15,104],[15,105,15,106],[15,107,15,108],[15,109,15,110],[15,91,15,92],[15,93,15,94],[15,95,15,96],[15,97,15,98],[15,99,15,100],[15,81,15,82],[15,83,15,84],[15,85,15,86],[15,87,15,88],[15,89,15,90],[15,71,15,72],[15,73,15,74],[15,75,15,76],[15,77,15,78],[15,79,15,80],[14,101,14,102],[14,103,14,104],[14,105,14,106],[14,107,14,108],[14,109,14,110],[14,91,14,92],[14,93,14,94],[14,95,14,96],[14,97,14,98],[14,99,14,100],[14,81,14,82],[14,83,14,84],[14,85,14,86],[14,87,14,88],[14,89,14,90],[14,71,14,72],[14,73,14,74],[14,75,14,76],[14,77,14,78],[14,79,14,80],[13,101,13,102],[13,103,13,104],[13,105,13,106],[13,107,13,108],[13,109,13,110],[13,91,13,92],[13,93,13,94],[13,95,13,96],[13,97,13,98],[13,99,13,100],[13,81,13,82],[13,83,13,84],[13,85,13,86],[13,87,13,88],[13,89,13,90],[13,71,13,72],[13,73,13,74],[13,75,13,76],[13,77,13,78],[13,79,13,80],[21,62,22,62],[13,63,13,64],[13,65,13,66],[13,67,13,68],[13,69,13,70],[14,63,14,64],[14,65,14,66],[14,67,14,68],[14,69,14,70],[15,63,15,64],[15,65,15,66],[15,67,15,68],[15,69,15,70],[16,63,16,64],[16,65,16,66],[16,67,16,68],[19,61,19,62],[17,61,17,62],[15,61,15,62],[13,61,13,62],[17,69,17,70],[21,63,22,63],[21,64,22,64],[21,65,22,65],[21,47,22,47],[21,48,22,48],[21,49,22,49],[21,50,22,50],[21,51,22,51],[21,52,22,52],[21,53,22,53],[21,54,22,54],[21,55,22,55],[21,56,22,56],[21,57,22,57],[21,58,22,58],[21,59,22,59],[21,60,22,60],[21,61,22,61],[19,51,19,52],[19,53,19,54],[19,55,19,56],[19,57,19,58],[19,59,19,60],[18,51,18,52],[18,53,18,54],[18,55,18,56],[18,57,18,58],[18,59,18,60],[18,61,18,62],[17,51,17,52],[17,53,17,54],[17,55,17,56],[17,57,17,58],[17,59,17,60],[16,51,16,52],[16,53,16,54],[16,55,16,56],[16,57,16,58],[16,59,16,60],[16,61,16,62],[15,51,15,52],[15,53,15,54],[15,55,15,56],[15,57,15,58],[15,59,15,60],[14,51,14,52],[14,53,14,54],[14,55,14,56],[14,57,14,58],[14,59,14,60],[14,61,14,62],[13,51,13,52],[13,53,13,54],[13,55,13,56],[13,57,13,58],[13,59,13,60],[13,47,13,48],[13,49,13,50],[15,47,15,48],[15,49,15,50],[17,47,17,48],[17,49,17,50],[19,47,19,48],[19,49,19,50],[14,47,14,48],[14,49,14,50],[16,47,16,48],[16,49,16,50],[18,47,18,48],[18,49,18,50],[19,43,19,44],[19,45,19,46],[21,31,22,31],[21,32,22,32],[21,33,22,33],[21,34,22,34],[21,35,22,35],[21,36,22,36],[21,37,22,37],[21,38,22,38],[21,39,22,39],[21,40,22,40],[21,41,22,41],[21,42,22,42],[21,43,22,43],[19,31,19,32],[19,33,19,34],[19,35,19,36],[19,37,19,38],[19,39,19,40],[21,44,22,44],[21,45,22,45],[21,46,22,46],[17,43,17,44],[17,45,17,46],[18,31,18,32],[18,33,18,34],[18,35,18,36],[18,37,18,38],[18,39,18,40],[18,41,18,42],[18,43,18,44],[18,45,18,46],[17,31,17,32],[17,33,17,34],[17,35,17,36],[17,37,17,38],[17,39,17,40],[15,43,15,44],[15,45,15,46],[16,31,16,32],[16,33,16,34],[16,35,16,36],[16,37,16,38],[16,39,16,40],[16,41,16,42],[16,43,16,44],[16,45,16,46],[15,31,15,32],[15,33,15,34],[15,35,15,36],[15,37,15,38],[15,39,15,40],[13,43,13,44],[13,45,13,46],[14,31,14,32],[14,33,14,34],[14,35,14,36],[14,37,14,38],[14,39,14,40],[14,41,14,42],[14,43,14,44],[14,45,14,46],[13,31,13,32],[13,33,13,34],[13,35,13,36],[13,37,13,38],[13,39,13,40],[21,23,22,23],[21,24,22,24],[21,25,22,25],[21,26,22,26],[21,27,22,27],[21,28,22,28],[21,29,22,29],[21,30,22,30],[13,41,13,42],[15,41,15,42],[17,41,17,42],[19,41,19,42],[15,23,15,24],[15,25,15,26],[15,27,15,28],[15,29,15,30],[16,23,16,24],[16,25,16,26],[16,27,16,28],[16,29,16,30],[19,23,19,24],[19,25,19,26],[19,27,19,28],[19,29,19,30],[13,23,13,24],[13,25,13,26],[13,27,13,28],[13,29,13,30],[14,23,14,24],[14,25,14,26],[14,27,14,28],[14,29,14,30],[19,19,19,20],[19,21,19,22],[13,19,13,20],[13,21,13,22],[14,19,14,20],[14,21,14,22],[15,19,15,20],[15,21,15,22],[17,23,17,24],[17,25,17,26],[17,27,17,28],[17,29,17,30],[18,23,18,24],[18,25,18,26],[18,27,18,28],[18,29,18,30],[35,1,35,5],[36,1,36,5],[37,1,37,5],[21,19,22,19],[21,20,22,20],[21,21,22,21],[21,22,22,22],[16,19,16,20],[16,21,16,22],[17,19,17,20],[17,21,17,22],[18,19,18,20],[18,21,18,22],[26,1,26,5],[27,1,27,5],[28,1,28,5],[29,1,29,5],[30,1,30,5],[31,1,31,5],[32,1,32,5],[33,1,33,5],[34,1,34,5],[21,15,22,15],[21,16,22,16],[3,2,3,3],[4,2,4,7],[5,2,5,7],[13,9,13,10],[15,9,15,10],[14,9,14,10],[4,9,4,13],[5,9,5,13],[17,11,17,12],[13,13,13,14],[14,13,14,14],[15,13,15,14],[16,13,16,14],[17,13,17,14],[13,11,13,12],[14,11,14,12],[15,11,15,12],[16,11,16,12],[3,4,3,5],[3,6,3,7],[42,0,42,6],[21,13,22,13],[21,14,22,14],[21,10,22,10],[21,9,22,9],[21,11,22,11],[21,12,22,12],[16,9,16,10],[17,9,17,10],[18,9,18,10],[19,9,19,10],[18,11,18,12],[19,11,19,12],[18,13,18,14],[19,13,19,14],[38,1,38,5],[39,1,39,5],[40,1,40,5],[41,1,41,5],[21,1,22,5],[21,6,21,7],[23,1,23,5],[24,1,24,5],[25,1,25,5],[13,0,22,0],[21,17,22,17],[21,18,22,18],[7,0,7,1],[7,2,7,5],[8,0,8,1],[9,0,9,1],[17,15,17,16],[18,15,18,16],[19,15,19,16],[13,17,13,18],[14,17,14,18],[15,17,15,18],[16,17,16,18],[17,17,17,18],[18,17,18,18],[19,17,19,18],[13,15,13,16],[14,15,14,16],[15,15,15,16],[16,15,16,16]]}
[" ",{"$f":"COLUMN()","v":2},{"$f":"COLUMN()","v":3},{"$f":"COLUMN()","v":4},{"$f":"COLUMN()","v":5},{"$f":"COLUMN()","v":6},{"$f":"COLUMN()","v":7},{"$f":"COLUMN()","v":8},{"$f":"COLUMN()","v":9},{"$f":"COLUMN()","v":10},{"$f":"COLUMN()","v":11},{"$f":"COLUMN()","v":12},{"$f":"COLUMN()","v":13},{"$f":"COLUMN()","v":14},{"$f":"COLUMN()","v":15},{"$f":"COLUMN()","v":16},{"$f":"COLUMN()","v":17},{"$f":"COLUMN()","v":18},{"$f":"COLUMN()","v":19},{"$f":"COLUMN()","v":20},{"$f":"COLUMN()","v":21},{"$f":"COLUMN()","v":22},{"$f":"COLUMN()","v":23},{"$f":"COLUMN()","v":24},{"$f":"COLUMN()","v":25},{"$f":"COLUMN()","v":26},{"$f":"COLUMN()","v":27},{"$f":"COLUMN()","v":28},{"$f":"COLUMN()","v":29},{"$f":"COLUMN()","v":30},{"$f":"COLUMN()","v":31},{"$f":"COLUMN()","v":32},{"$f":"COLUMN()","v":33},{"$f":"COLUMN()","v":34},{"$f":"COLUMN()","v":35},{"$f":"COLUMN()","v":36},{"$f":"COLUMN()","v":37},{"$f":"COLUMN()","v":38},{"$f":"COLUMN()","v":39},{"$f":"COLUMN()","v":40},{"$f":"COLUMN()","v":41},{"$f":"COLUMN()","v":42},{"$f":"COLUMN()","v":43},{"$f":"COLUMN()","v":44},{"$f":"COLUMN()","v":45},{"$f":"COLUMN()","v":46},{"$f":"COLUMN()","v":47},{"$f":"COLUMN()","v":48},{"$f":"COLUMN()","v":49},{"$f":"COLUMN()","v":50},{"$f":"COLUMN()","v":51},{"$f":"COLUMN()","v":52},{"$f":"COLUMN()","v":53},{"$f":"COLUMN()","v":54},{"$f":"COLUMN()","v":55},{"$f":"COLUMN()","v":56},{"$f":"COLUMN()","v":57},{"$f":"COLUMN()","v":58},{"$f":"COLUMN()","v":59},{"$f":"COLUMN()","v":60},{"$f":"COLUMN()","v":61},{"$f":"COLUMN()","v":62},{"$f":"COLUMN()","v":63},{"$f":"COLUMN()","v":64},{"$f":"COLUMN()","v":65},{"$f":"COLUMN()","v":66},{"$f":"COLUMN()","v":67},{"$f":"COLUMN()","v":68},{"$f":"COLUMN()","v":69},{"$f":"COLUMN()","v":70},{"$f":"COLUMN()","v":71},{"$f":"COLUMN()","v":72},{"$f":"COLUMN()","v":73},{"$f":"COLUMN()","v":74},{"$f":"COLUMN()","v":75},{"$f":"COLUMN()","v":76},{"$f":"COLUMN()","v":77},{"$f":"COLUMN()","v":78},{"$f":"COLUMN()","v":79},{"$f":"COLUMN()","v":80},{"$f":"COLUMN()","v":81},{"$f":"COLUMN()","v":82},{"$f":"COLUMN()","v":83},{"$f":"COLUMN()","v":84},{"$f":"COLUMN()","v":85},{"$f":"COLUMN()","v":86},{"$f":"COLUMN()","v":87},{"$f":"COLUMN()","v":88},{"$f":"COLUMN()","v":89},{"$f":"COLUMN()","v":90},{"$f":"COLUMN()","v":91},{"$f":"COLUMN()","v":92},{"$f":"COLUMN()","v":93},{"$f":"COLUMN()","v":94},{"$f":"COLUMN()","v":95},{"$f":"COLUMN()","v":96},{"$f":"COLUMN()","v":97},{"$f":"COLUMN()","v":98},{"$f":"COLUMN()","v":99},{"$f":"COLUMN()","v":100},{"$f":"COLUMN()","v":101},{"$f":"COLUMN()","v":102},{"$f":"COLUMN()","v":103},{"$f":"COLUMN()","v":104},{"$f":"COLUMN()","v":105},{"$f":"COLUMN()","v":106},{"$f":"COLUMN()","v":107},{"$f":"COLUMN()","v":108},{"$f":"COLUMN()","v":109},{"$f":"COLUMN()","v":110},{"$f":"COLUMN()","v":111},{"$f":"COLUMN()","v":112},{"$f":"COLUMN()","v":113},{"$f":"COLUMN()","v":114},{"$f":"COLUMN()","v":115},{"$f":"COLUMN()","v":116},{"$f":"COLUMN()","v":117},{"$f":"COLUMN()","v":118},{"$f":"COLUMN()","v":119},{"$f":"COLUMN()","v":120},{"$f":"COLUMN()","v":121},{"$f":"COLUMN()","v":122},{"$f":"COLUMN()","v":123},{"$f":"COLUMN()","v":124},{"$f":"COLUMN()","v":125},{"$f":"COLUMN()","v":126},{"$f":"COLUMN()","v":127},{"$f":"COLUMN()","v":128},{"$f":"COLUMN()","v":129},{"$f":"COLUMN()","v":130},{"$f":"COLUMN()","v":131},{"$f":"COLUMN()","v":132},{"$f":"COLUMN()","v":133},{"$f":"COLUMN()","v":134},{"$f":"COLUMN()","v":135},{"$f":"COLUMN()","v":136},{"$f":"COLUMN()","v":137},{"$f":"COLUMN()","v":138},{"$f":"COLUMN()","v":139},{"$f":"COLUMN()","v":140},{"$f":"COLUMN()","v":141},{"$f":"COLUMN()","v":142},{"$f":"COLUMN()","v":143},{"$f":"COLUMN()","v":144},{"$f":"COLUMN()","v":145},{"$f":"COLUMN()","v":146},{"$f":"COLUMN()","v":147},{"$f":"COLUMN()","v":148},{"$f":"COLUMN()","v":149},{"$f":"COLUMN()","v":150},{"$f":"COLUMN()","v":151},{"$f":"COLUMN()","v":152},{"$f":"COLUMN()","v":153},{"$f":"COLUMN()","v":154},{"$f":"COLUMN()","v":155},{"$f":"COLUMN()","v":156},{"$f":"COLUMN()","v":157},{"$f":"COLUMN()","v":158},{"$f":"COLUMN()","v":159},{"$f":"COLUMN()","v":160},{"$f":"COLUMN()","v":161},{"$f":"COLUMN()","v":162},{"$f":"COLUMN()","v":163},{"$f":"COLUMN()","v":164},{"$f":"COLUMN()","v":165},{"$f":"COLUMN()","v":166},{"$f":"COLUMN()","v":167},{"$f":"COLUMN()","v":168},{"$f":"COLUMN()","v":169}]
[2,null,null,null,null,null,null,null,null,{"$f":"IFERROR(VLOOKUP(INT((J$1-8)/2)&\".YC\",CCR_0!$P:$Q,2,0),\"\")","v":""},{"$f":"IFERROR(VLOOKUP(INT((K$1-8)/2)&\".YC\",CCR_0!$P:$Q,2,0),\"\")","v":""},{"$f":"IFERROR(VLOOKUP(INT((L$1-8)/2)&\".YC\",CCR_0!$P:$Q,2,0),\"\")","v":""},{"$f":"IFERROR(VLOOKUP(INT((M$1-8)/2)&\".YC\",CCR_0!$P:$Q,2,0),\"\")","v":""},{"$f":"IFERROR(VLOOKUP(INT((N$1-8)/2)&\".YC\",CCR_0!$P:$Q,2,0),\"\")","v":""},{"$f":"IFERROR(VLOOKUP(INT((O$1-8)/2)&\".YC\",CCR_0!$P:$Q,2,0),\"\")","v":""},{"$f":"IFERROR(VLOOKUP(INT((P$1-8)/2)&\".YC\",CCR_0!$P:$Q,2,0),\"\")","v":""},{"$f":"IFERROR(VLOOKUP(INT((Q$1-8)/2)&\".YC\",CCR_0!$P:$Q,2,0),\"\")","v":""},{"$f":"IFERROR(VLOOKUP(INT((R$1-8)/2)&\".YC\",CCR_0!$P:$Q,2,0),\"\")","v":""},{"$f":"IFERROR(VLOOKUP(INT((S$1-8)/2)&\".YC\",CCR_0!$P:$Q,2,0),\"\")","v":""},{"$f":"IFERROR(VLOOKUP(INT((T$1-8)/2)&\".YC\",CCR_0!$P:$Q,2,0),\"\")","v":""},{"$f":"IFERROR(VLOOKUP(INT((U$1-8)/2)&\".YC\",CCR_0!$P:$Q,2,0),\"\")","v":""},{"$f":"IFERROR(VLOOKUP(INT((V$1-8)/2)&\".YC\",CCR_0!$P:$Q,2,0),\"\")","v":""},{"$f":"IFERROR(VLOOKUP(INT((W$1-8)/2)&\".YC\",CCR_0!$P:$Q,2,0),\"\")","v":""},{"$f":"IFERROR(VLOOKUP(INT((X$1-8)/2)&\".YC\",CCR_0!$P:$Q,2,0),\"\")","v":""},{"$f":"IFERROR(VLOOKUP(INT((Y$1-8)/2)&\".YC\",CCR_0!$P:$Q,2,0),\"\")","v":""},{"$f":"IFERROR(VLOOKUP(INT((Z$1-8)/2)&\".YC\",CCR_0!$P:$Q,2,0),\"\")","v":""},{"$f":"IFERROR(VLOOKUP(INT((AA$1-8)/2)&\".YC\",CCR_0!$P:$Q,2,0),\"\")","v":""},{"$f":"IFERROR(VLOOKUP(INT((AB$1-8)/2)&\".YC\",CCR_0!$P:$Q,2,0),\"\")","v":""},{"$f":"IFERROR(VLOOKUP(INT((AC$1-8)/2)&\".YC\",CCR_0!$P:$Q,2,0),\"\")","v":""},{"$f":"IFERROR(VLOOKUP(INT((AD$1-8)/2)&\".YC\",CCR_0!$P:$Q,2,0),\"\")","v":""},{"$f":"IFERROR(VLOOKUP(INT((AE$1-8)/2)&\".YC\",CCR_0!$P:$Q,2,0),\"\")","v":""},{"$f":"IFERROR(VLOOKUP(INT((AF$1-8)/2)&\".YC\",CCR_0!$P:$Q,2,0),\"\")","v":""},{"$f":"IFERROR(VLOOKUP(INT((AG$1-8)/2)&\".YC\",CCR_0!$P:$Q,2,0),\"\")","v":""},{"$f":"IFERROR(VLOOKUP(INT((AH$1-8)/2)&\".YC\",CCR_0!$P:$Q,2,0),\"\")","v":""},{"$f":"IFERROR(VLOOKUP(INT((AI$1-8)/2)&\".YC\",CCR_0!$P:$Q,2,0),\"\")","v":""},{"$f":"IFERROR(VLOOKUP(INT((AJ$1-8)/2)&\".YC\",CCR_0!$P:$Q,2,0),\"\")","v":""},{"$f":"IFERROR(VLOOKUP(INT((AK$1-8)/2)&\".YC\",CCR_0!$P:$Q,2,0),\"\")","v":""},{"$f":"IFERROR(VLOOKUP(INT((AL$1-8)/2)&\".YC\",CCR_0!$P:$Q,2,0),\"\")","v":""},{"$f":"IFERROR(VLOOKUP(INT((AM$1-8)/2)&\".YC\",CCR_0!$P:$Q,2,0),\"\")","v":""},{"$f":"IFERROR(VLOOKUP(INT((AN$1-8)/2)&\".YC\",CCR_0!$P:$Q,2,0),\"\")","v":""},{"$f":"IFERROR(VLOOKUP(INT((AO$1-8)/2)&\".YC\",CCR_0!$P:$Q,2,0),\"\")","v":""},{"$f":"IFERROR(VLOOKUP(INT((AP$1-8)/2)&\".YC\",CCR_0!$P:$Q,2,0),\"\")","v":""},{"$f":"IFERROR(VLOOKUP(INT((AQ$1-8)/2)&\".YC\",CCR_0!$P:$Q,2,0),\"\")","v":""},{"$f":"IFERROR(VLOOKUP(INT((AR$1-8)/2)&\".YC\",CCR_0!$P:$Q,2,0),\"\")","v":""},{"$f":"IFERROR(VLOOKUP(INT((AS$1-8)/2)&\".YC\",CCR_0!$P:$Q,2,0),\"\")","v":""},{"$f":"IFERROR(VLOOKUP(INT((AT$1-8)/2)&\".YC\",CCR_0!$P:$Q,2,0),\"\")","v":""},{"$f":"IFERROR(VLOOKUP(INT((AU$1-8)/2)&\".YC\",CCR_0!$P:$Q,2,0),\"\")","v":""},{"$f":"IFERROR(VLOOKUP(INT((AV$1-8)/2)&\".YC\",CCR_0!$P:$Q,2,0),\"\")","v":""},{"$f":"IFERROR(VLOOKUP(INT((AW$1-8)/2)&\".YC\",CCR_0!$P:$Q,2,0),\"\")","v":""},{"$f":"IFERROR(VLOOKUP(INT((AX$1-8)/2)&\".YC\",CCR_0!$P:$Q,2,0),\"\")","v":""},{"$f":"IFERROR(VLOOKUP(INT((AY$1-8)/2)&\".YC\",CCR_0!$P:$Q,2,0),\"\")","v":""},{"$f":"IFERROR(VLOOKUP(INT((AZ$1-8)/2)&\".YC\",CCR_0!$P:$Q,2,0),\"\")","v":""},{"$f":"IFERROR(VLOOKUP(INT((BA$1-8)/2)&\".YC\",CCR_0!$P:$Q,2,0),\"\")","v":""},{"$f":"IFERROR(VLOOKUP(INT((BB$1-8)/2)&\".YC\",CCR_0!$P:$Q,2,0),\"\")","v":""},{"$f":"IFERROR(VLOOKUP(INT((BC$1-8)/2)&\".YC\",CCR_0!$P:$Q,2,0),\"\")","v":""},{"$f":"IFERROR(VLOOKUP(INT((BD$1-8)/2)&\".YC\",CCR_0!$P:$Q,2,0),\"\")","v":""},{"$f":"IFERROR(VLOOKUP(INT((BE$1-8)/2)&\".YC\",CCR_0!$P:$Q,2,0),\"\")","v":""},{"$f":"IFERROR(VLOOKUP(INT((BF$1-8)/2)&\".YC\",CCR_0!$P:$Q,2,0),\"\")","v":""},{"$f":"IFERROR(VLOOKUP(INT((BG$1-8)/2)&\".YC\",CCR_0!$P:$Q,2,0),\"\")","v":""},{"$f":"IFERROR(VLOOKUP(INT((BH$1-8)/2)&\".YC\",CCR_0!$P:$Q,2,0),\"\")","v":""},{"$f":"IFERROR(VLOOKUP(INT((BI$1-8)/2)&\".YC\",CCR_0!$P:$Q,2,0),\"\")","v":""},{"$f":"IFERROR(VLOOKUP(INT((BJ$1-8)/2)&\".YC\",CCR_0!$P:$Q,2,0),\"\")","v":""},{"$f":"IFERROR(VLOOKUP(INT((BK$1-8)/2)&\".YC\",CCR_0!$P:$Q,2,0),\"\")","v":""},{"$f":"IFERROR(VLOOKUP(INT((BL$1-8)/2)&\".YC\",CCR_0!$P:$Q,2,0),\"\")","v":""},{"$f":"IFERROR(VLOOKUP(INT((BM$1-8)/2)&\".YC\",CCR_0!$P:$Q,2,0),\"\")","v":""},{"$f":"IFERROR(VLOOKUP(INT((BN$1-8)/2)&\".YC\",CCR_0!$P:$Q,2,0),\"\")","v":""},{"$f":"IFERROR(VLOOKUP(INT((BO$1-8)/2)&\".YC\",CCR_0!$P:$Q,2,0),\"\")","v":""},{"$f":"IFERROR(VLOOKUP(INT((BP$1-8)/2)&\".YC\",CCR_0!$P:$Q,2,0),\"\")","v":""},{"$f":"IFERROR(VLOOKUP(INT((BQ$1-8)/2)&\".YC\",CCR_0!$P:$Q,2,0),\"\")","v":""},{"$f":"IFERROR(VLOOKUP(INT((BR$1-8)/2)&\".YC\",CCR_0!$P:$Q,2,0),\"\")","v":""},{"$f":"IFERROR(VLOOKUP(INT((BS$1-8)/2)&\".YC\",CCR_0!$P:$Q,2,0),\"\")","v":""},{"$f":"IFERROR(VLOOKUP(INT((BT$1-8)/2)&\".YC\",CCR_0!$P:$Q,2,0),\"\")","v":""},{"$f":"IFERROR(VLOOKUP(INT((BU$1-8)/2)&\".YC\",CCR_0!$P:$Q,2,0),\"\")","v":""},{"$f":"IFERROR(VLOOKUP(INT((BV$1-8)/2)&\".YC\",CCR_0!$P:$Q,2,0),\"\")","v":""},{"$f":"IFERROR(VLOOKUP(INT((BW$1-8)/2)&\".YC\",CCR_0!$P:$Q,2,0),\"\")","v":""},{"$f":"IFERROR(VLOOKUP(INT((BX$1-8)/2)&\".YC\",CCR_0!$P:$Q,2,0),\"\")","v":""},{"$f":"IFERROR(VLOOKUP(INT((BY$1-8)/2)&\".YC\",CCR_0!$P:$Q,2,0),\"\")","v":""},{"$f":"IFERROR(VLOOKUP(INT((BZ$1-8)/2)&\".YC\",CCR_0!$P:$Q,2,0),\"\")","v":""},{"$f":"IFERROR(VLOOKUP(INT((CA$1-8)/2)&\".YC\",CCR_0!$P:$Q,2,0),\"\")","v":""},{"$f":"IFERROR(VLOOKUP(INT((CB$1-8)/2)&\".YC\",CCR_0!$P:$Q,2,0),\"\")","v":""},{"$f":"IFERROR(VLOOKUP(INT((CC$1-8)/2)&\".YC\",CCR_0!$P:$Q,2,0),\"\")","v":""},{"$f":"IFERROR(VLOOKUP(INT((CD$1-8)/2)&\".YC\",CCR_0!$P:$Q,2,0),\"\")","v":""},{"$f":"IFERROR(VLOOKUP(INT((CE$1-8)/2)&\".YC\",CCR_0!$P:$Q,2,0),\"\")","v":""},{"$f":"IFERROR(VLOOKUP(INT((CF$1-8)/2)&\".YC\",CCR_0!$P:$Q,2,0),\"\")","v":""},{"$f":"IFERROR(VLOOKUP(INT((CG$1-8)/2)&\".YC\",CCR_0!$P:$Q,2,0),\"\")","v":""},{"$f":"IFERROR(VLOOKUP(INT((CH$1-8)/2)&\".YC\",CCR_0!$P:$Q,2,0),\"\")","v":""},{"$f":"IFERROR(VLOOKUP(INT((CI$1-8)/2)&\".YC\",CCR_0!$P:$Q,2,0),\"\")","v":""},{"$f":"IFERROR(VLOOKUP(INT((CJ$1-8)/2)&\".YC\",CCR_0!$P:$Q,2,0),\"\")","v":""},{"$f":"IFERROR(VLOOKUP(INT((CK$1-8)/2)&\".YC\",CCR_0!$P:$Q,2,0),\"\")","v":""},{"$f":"IFERROR(VLOOKUP(INT((CL$1-8)/2)&\".YC\",CCR_0!$P:$Q,2,0),\"\")","v":""},{"$f":"IFERROR(VLOOKUP(INT((CM$1-8)/2)&\".YC\",CCR_0!$P:$Q,2,0),\"\")","v":""},{"$f":"IFERROR(VLOOKUP(INT((CN$1-8)/2)&\".YC\",CCR_0!$P:$Q,2,0),\"\")","v":""},{"$f":"IFERROR(VLOOKUP(INT((CO$1-8)/2)&\".YC\",CCR_0!$P:$Q,2,0),\"\")","v":""},{"$f":"IFERROR(VLOOKUP(INT((CP$1-8)/2)&\".YC\",CCR_0!$P:$Q,2,0),\"\")","v":""},{"$f":"IFERROR(VLOOKUP(INT((CQ$1-8)/2)&\".YC\",CCR_0!$P:$Q,2,0),\"\")","v":""},{"$f":"IFERROR(VLOOKUP(INT((CR$1-8)/2)&\".YC\",CCR_0!$P:$Q,2,0),\"\")","v":""},{"$f":"IFERROR(VLOOKUP(INT((CS$1-8)/2)&\".YC\",CCR_0!$P:$Q,2,0),\"\")","v":""},{"$f":"IFERROR(VLOOKUP(INT((CT$1-8)/2)&\".YC\",CCR_0!$P:$Q,2,0),\"\")","v":""},{"$f":"IFERROR(VLOOKUP(INT((CU$1-8)/2)&\".YC\",CCR_0!$P:$Q,2,0),\"\")","v":""},{"$f":"IFERROR(VLOOKUP(INT((CV$1-8)/2)&\".YC\",CCR_0!$P:$Q,2,0),\"\")","v":""},{"$f":"IFERROR(VLOOKUP(INT((CW$1-8)/2)&\".YC\",CCR_0!$P:$Q,2,0),\"\")","v":""},{"$f":"IFERROR(VLOOKUP(INT((CX$1-8)/2)&\".YC\",CCR_0!$P:$Q,2,0),\"\")","v":""},{"$f":"IFERROR(VLOOKUP(INT((CY$1-8)/2)&\".YC\",CCR_0!$P:$Q,2,0),\"\")","v":""},{"$f":"IFERROR(VLOOKUP(INT((CZ$1-8)/2)&\".YC\",CCR_0!$P:$Q,2,0),\"\")","v":""},{"$f":"IFERROR(VLOOKUP(INT((DA$1-8)/2)&\".YC\",CCR_0!$P:$Q,2,0),\"\")","v":""},{"$f":"IFERROR(VLOOKUP(INT((DB$1-8)/2)&\".YC\",CCR_0!$P:$Q,2,0),\"\")","v":""},{"$f":"IFERROR(VLOOKUP(INT((DC$1-8)/2)&\".YC\",CCR_0!$P:$Q,2,0),\"\")","v":""},{"$f":"IFERROR(VLOOKUP(INT((DD$1-8)/2)&\".YC\",CCR_0!$P:$Q,2,0),\"\")","v":""},{"$f":"IFERROR(VLOOKUP(INT((DE$1-8)/2)&\".YC\",CCR_0!$P:$Q,2,0),\"\")","v":""},{"$f":"IFERROR(VLOOKUP(INT((DF$1-8)/2)&\".YC\",CCR_0!$P:$Q,2,0),\"\")","v":""},{"$f":"IFERROR(VLOOKUP(INT((DG$1-8)/2)&\".YC\",CCR_0!$P:$Q,2,0),\"\")","v":""},{"$f":"IFERROR(VLOOKUP(INT((DH$1-8)/2)&\".YC\",CCR_0!$P:$Q,2,0),\"\")","v":""},{"$f":"IFERROR(VLOOKUP(INT((DI$1-8)/2)&\".YC\",CCR_0!$P:$Q,2,0),\"\")","v":""},{"$f":"IFERROR(VLOOKUP(INT((DJ$1-8)/2)&\".YC\",CCR_0!$P:$Q,2,0),\"\")","v":""},{"$f":"IFERROR(VLOOKUP(INT((DK$1-8)/2)&\".YC\",CCR_0!$P:$Q,2,0),\"\")","v":""},{"$f":"IFERROR(VLOOKUP(INT((DL$1-8)/2)&\".YC\",CCR_0!$P:$Q,2,0),\"\")","v":""},{"$f":"IFERROR(VLOOKUP(INT((DM$1-8)/2)&\".YC\",CCR_0!$P:$Q,2,0),\"\")","v":""},{"$f":"IFERROR(VLOOKUP(INT((DN$1-8)/2)&\".YC\",CCR_0!$P:$Q,2,0),\"\")","v":""},{"$f":"IFERROR(VLOOKUP(INT((DO$1-8)/2)&\".YC\",CCR_0!$P:$Q,2,0),\"\")","v":""},{"$f":"IFERROR(VLOOKUP(INT((DP$1-8)/2)&\".YC\",CCR_0!$P:$Q,2,0),\"\")","v":""},{"$f":"IFERROR(VLOOKUP(INT((DQ$1-8)/2)&\".YC\",CCR_0!$P:$Q,2,0),\"\")","v":""},{"$f":"IFERROR(VLOOKUP(INT((DR$1-8)/2)&\".YC\",CCR_0!$P:$Q,2,0),\"\")","v":""},{"$f":"IFERROR(VLOOKUP(INT((DS$1-8)/2)&\".YC\",CCR_0!$P:$Q,2,0),\"\")","v":""},{"$f":"IFERROR(VLOOKUP(INT((DT$1-8)/2)&\".YC\",CCR_0!$P:$Q,2,0),\"\")","v":""},{"$f":"IFERROR(VLOOKUP(INT((DU$1-8)/2)&\".YC\",CCR_0!$P:$Q,2,0),\"\")","v":""},{"$f":"IFERROR(VLOOKUP(INT((DV$1-8)/2)&\".YC\",CCR_0!$P:$Q,2,0),\"\")","v":""},{"$f":"IFERROR(VLOOKUP(INT((DW$1-8)/2)&\".YC\",CCR_0!$P:$Q,2,0),\"\")","v":""},{"$f":"IFERROR(VLOOKUP(INT((DX$1-8)/2)&\".YC\",CCR_0!$P:$Q,2,0),\"\")","v":""},{"$f":"IFERROR(VLOOKUP(INT((DY$1-8)/2)&\".YC\",CCR_0!$P:$Q,2,0),\"\")","v":""},{"$f":"IFERROR(VLOOKUP(INT((DZ$1-8)/2)&\".YC\",CCR_0!$P:$Q,2,0),\"\")","v":""},{"$f":"IFERROR(VLOOKUP(INT((EA$1-8)/2)&\".YC\",CCR_0!$P:$Q,2,0),\"\")","v":""},{"$f":"IFERROR(VLOOKUP(INT((EB$1-8)/2)&\".YC\",CCR_0!$P:$Q,2,0),\"\")","v":""},{"$f":"IFERROR(VLOOKUP(INT((EC$1-8)/2)&\".YC\",CCR_0!$P:$Q,2,0),\"\")","v":""},{"$f":"IFERROR(VLOOKUP(INT((ED$1-8)/2)&\".YC\",CCR_0!$P:$Q,2,0),\"\")","v":""},{"$f":"IFERROR(VLOOKUP(INT((EE$1-8)/2)&\".YC\",CCR_0!$P:$Q,2,0),\"\")","v":""},{"$f":"IFERROR(VLOOKUP(INT((EF$1-8)/2)&\".YC\",CCR_0!$P:$Q,2,0),\"\")","v":""},{"$f":"IFERROR(VLOOKUP(INT((EG$1-8)/2)&\".YC\",CCR_0!$P:$Q,2,0),\"\")","v":""},{"$f":"IFERROR(VLOOKUP(INT((EH$1-8)/2)&\".YC\",CCR_0!$P:$Q,2,0),\"\")","v":""},{"$f":"IFERROR(VLOOKUP(INT((EI$1-8)/2)&\".YC\",CCR_0!$P:$Q,2,0),\"\")","v":""},{"$f":"IFERROR(VLOOKUP(INT((EJ$1-8)/2)&\".YC\",CCR_0!$P:$Q,2,0),\"\")","v":""},{"$f":"IFERROR(VLOOKUP(INT((EK$1-8)/2)&\".YC\",CCR_0!$P:$Q,2,0),\"\")","v":""},{"$f":"IFERROR(VLOOKUP(INT((EL$1-8)/2)&\".YC\",CCR_0!$P:$Q,2,0),\"\")","v":""},{"$f":"IFERROR(VLOOKUP(INT((EM$1-8)/2)&\".YC\",CCR_0!$P:$Q,2,0),\"\")","v":""},{"$f":"IFERROR(VLOOKUP(INT((EN$1-8)/2)&\".YC\",CCR_0!$P:$Q,2,0),\"\")","v":""},{"$f":"IFERROR(VLOOKUP(INT((EO$1-8)/2)&\".YC\",CCR_0!$P:$Q,2,0),\"\")","v":""},{"$f":"IFERROR(VLOOKUP(INT((EP$1-8)/2)&\".YC\",CCR_0!$P:$Q,2,0),\"\")","v":""},{"$f":"IFERROR(VLOOKUP(INT((EQ$1-8)/2)&\".YC\",CCR_0!$P:$Q,2,0),\"\")","v":""},{"$f":"IFERROR(VLOOKUP(INT((ER$1-8)/2)&\".YC\",CCR_0!$P:$Q,2,0),\"\")","v":""},{"$f":"IFERROR(VLOOKUP(INT((ES$1-8)/2)&\".YC\",CCR_0!$P:$Q,2,0),\"\")","v":""},{"$f":"IFERROR(VLOOKUP(INT((ET$1-8)/2)&\".YC\",CCR_0!$P:$Q,2,0),\"\")","v":""},{"$f":"IFERROR(VLOOKUP(INT((EU$1-8)/2)&\".YC\",CCR_0!$P:$Q,2,0),\"\")","v":""},{"$f":"IFERROR(VLOOKUP(INT((EV$1-8)/2)&\".YC\",CCR_0!$P:$Q,2,0),\"\")","v":""},{"$f":"IFERROR(VLOOKUP(INT((EW$1-8)/2)&\".YC\",CCR_0!$P:$Q,2,0),\"\")","v":""},{"$f":"IFERROR(VLOOKUP(INT((EX$1-8)/2)&\".YC\",CCR_0!$P:$Q,2,0),\"\")","v":""},{"$f":"IFERROR(VLOOKUP(INT((EY$1-8)/2)&\".YC\",CCR_0!$P:$Q,2,0),\"\")","v":""},{"$f":"IFERROR(VLOOKUP(INT((EZ$1-8)/2)&\".YC\",CCR_0!$P:$Q,2,0),\"\")","v":""},{"$f":"IFERROR(VLOOKUP(INT((FA$1-8)/2)&\".YC\",CCR_0!$P:$Q,2,0),\"\")","v":""},{"$f":"IFERROR(VLOOKUP(INT((FB$1-8)/2)&\".YC\",CCR_0!$P:$Q,2,0),\"\")","v":""},{"$f":"IFERROR(VLOOKUP(INT((FC$1-8)/2)&\".YC\",CCR_0!$P:$Q,2,0),\"\")","v":""},{"$f":"IFERROR(VLOOKUP(INT((FD$1-8)/2)&\".YC\",CCR_0!$P:$Q,2,0),\"\")","v":""},{"$f":"IFERROR(VLOOKUP(INT((FE$1-8)/2)&\".YC\",CCR_0!$P:$Q,2,0),\"\")","v":""},{"$f":"IFERROR(VLOOKUP(INT((FF$1-8)/2)&\".YC\",CCR_0!$P:$Q,2,0),\"\")","v":""},{"$f":"IFERROR(VLOOKUP(INT((FG$1-8)/2)&\".YC\",CCR_0!$P:$Q,2,0),\"\")","v":""},{"$f":"IFERROR(VLOOKUP(INT((FH$1-8)/2)&\".YC\",CCR_0!$P:$Q,2,0),\"\")","v":""},{"$f":"IFERROR(VLOOKUP(INT((FI$1-8)/2)&\".YC\",CCR_0!$P:$Q,2,0),\"\")","v":""},{"$f":"IFERROR(VLOOKUP(INT((FJ$1-8)/2)&\".YC\",CCR_0!$P:$Q,2,0),\"\")","v":""},{"$f":"IFERROR(VLOOKUP(INT((FK$1-8)/2)&\".YC\",CCR_0!$P:$Q,2,0),\"\")","v":""},{"$f":"IFERROR(VLOOKUP(INT((FL$1-8)/2)&\".YC\",CCR_0!$P:$Q,2,0),\"\")","v":""},{"$f":"IFERROR(VLOOKUP(INT((FM$1-8)/2)&\".YC\",CCR_0!$P:$Q,2,0),\"\")","v":""}]
[]
["TBI Provider ID",null,{"$f":"+IF(CCR_0!$C$4=\"\",\"\",CCR_0!$C$4)","v":""},null,"NHTD Provider ID",null,{"$f":"+IF(CCR_0!$G$4=\"\",\"\",CCR_0!$G$4)","v":""}]
["Agency Name",null,{"$f":"+IF(CCR_0!$C$5=\"\",\"\",IF(LEFT(CCR_0!$C$5,5) = \"C1010\", CCR_0!$C$6,CCR_0!$C$5))","v":""},null,null,null,null,null,null,"NEW YORK STATE"]
["New Agency",null,null,null,null,null,null,null,null,"CERTIFIED COST REPORT"]
["Funding State Agency",null,null,null,null,null,"Reporting Period"]
[null,null,"DOH",null,null,null,"Start Date","End Date",null,"SCHEDULE CCR-4A"]
[null,null,"TBI","NHTD",null,null,"mm/dd/yyyy","mm/dd/yyyy",null,"CONTRACTED DIRECT CARE AND CLINICAL"]
["NO",null,{"$f":"IF(CCR_0!C$10=\"\",\"\",CCR_0!C$10)","v":""},{"$f":"IF(CCR_0!D$10=\"\",\"\",CCR_0!D$10)","v":""},"NO",null,{"$f":"IF(CCR_1!G$10=\"\",\"\", CCR_1!G$10)","v":""},{"$f":"IF(CCR_1!H$10=\"\",\"\", CCR_1!H$10)","v":""},null,"PERSONAL SERVICES",null,null,null,"Rev. Feb. 2021"]
[]
["Refer to Appendix F for Position Title Codes and definitions."]
["Report only program/site specific positions (Position Title Codes 200-399 series)."]
["Position\nTitle Code\nAppendix\nF","Column Number",null,null,null,null,null,null,0,{"$f":"+IF(J2=\"\",\"\",H14+1)","v":""},null,{"$f":"+IF(L2=\"\",\"\",J14+1)","v":""},null,{"$f":"+IF(N2=\"\",\"\",L14+1)","v":""},null,{"$f":"+IF(P2=\"\",\"\",N14+1)","v":""},null,{"$f":"+IF(R2=\"\",\"\",P14+1)","v":""},null,{"$f":"+IF(T2=\"\",\"\",R14+1)","v":""},null,{"$f":"+IF(V2=\"\",\"\",T14+1)","v":""},null,{"$f":"+IF(X2=\"\",\"\",V14+1)","v":""},null,{"$f":"+IF(Z2=\"\",\"\",X14+1)","v":""},null,{"$f":"+IF(AB2=\"\",\"\",Z14+1)","v":""},null,{"$f":"+IF(AD2=\"\",\"\",AB14+1)","v":""},null,{"$f":"+IF(AF2=\"\",\"\",AD14+1)","v":""},null,{"$f":"+IF(AH2=\"\",\"\",AF14+1)","v":""},null,{"$f":"+IF(AJ2=\"\",\"\",AH14+1)","v":""},null,{"$f":"+IF(AL2=\"\",\"\",AJ14+1)","v":""},null,{"$f":"+IF(AN2=\"\",\"\",AL14+1)","v":""},null,{"$f":"+IF(AP2=\"\",\"\",AN14+1)","v":""},null,{"$f":"+IF(AR2=\"\",\"\",AP14+1)","v":""},null,{"$f":"+IF(AT2=\"\",\"\",AR14+1)","v":""},null,{"$f":"+IF(AV2=\"\",\"\",AT14+1)","v":""},null,{"$f":"+IF(AX2=\"\",\"\",AV14+1)","v":""},null,{"$f":"+IF(AZ2=\"\",\"\",AX14+1)","v":""},null,{"$f":"+IF(BB2=\"\",\"\",AZ14+1)","v":""},null,{"$f":"+IF(BD2=\"\",\"\",BB14+1)","v":""},null,{"$f":"+IF(BF2=\"\",\"\",BD14+1)","v":""},null,{"$f":"+IF(BH2=\"\",\"\",BF14+1)","v":""},null,{"$f":"+IF(BJ2=\"\",\"\",BH14+1)","v":""},null,{"$f":"+IF(BL2=\"\",\"\",BJ14+1)","v":""},null,{"$f":"+IF(BN2=\"\",\"\",BL14+1)","v":""},null,{"$f":"+IF(BP2=\"\",\"\",BN14+1)","v":""},null,{"$f":"+IF(BR2=\"\",\"\",BP14+1)","v":""},null,{"$f":"+IF(BT2=\"\",\"\",BR14+1)","v":""},null,{"$f":"+IF(BV2=\"\",\"\",BT14+1)","v":""},null,{"$f":"+IF(BX2=\"\",\"\",BV14+1)","v":""},null,{"$f":"+IF(BZ2=\"\",\"\",BX14+1)","v":""},null,{"$f":"+IF(CB2=\"\",\"\",BZ14+1)","v":""},null,{"$f":"+IF(CD2=\"\",\"\",CB14+1)","v":""},null,{"$f":"+IF(CF2=\"\",\"\",CD14+1)","v":""},null,{"$f":"+IF(CH2=\"\",\"\",CF14+1)","v":""},null,{"$f":"+IF(CJ2=\"\",\"\",CH14+1)","v":""},null,{"$f":"+IF(CL2=\"\",\"\",CJ14+1)","v":""},null,{"$f":"+IF(CN2=\"\",\"\",CL14+1)","v":""},null,{"$f":"+IF(CP2=\"\",\"\",CN14+1)","v":""},null,{"$f":"+IF(CR2=\"\",\"\",CP14+1)","v":""},null,{"$f":"+IF(CT2=\"\",\"\",CR14+1)","v":""},null,{"$f":"+IF(CV2=\"\",\"\",CT14+1)","v":""},null,{"$f":"+IF(CX2=\"\",\"\",CV14+1)","v":""},null,{"$f":"+IF(CZ2=\"\",\"\",CX14+1)","v":""},null,{"$f":"+IF(DB2=\"\",\"\",CZ14+1)","v":""},null,{"$f":"+IF(DD2=\"\",\"\",DB14+1)","v":""},null,{"$f":"+IF(DF2=\"\",\"\",DD14+1)","v":""},null,{"$f":"+IF(DH2=\"\",\"\",DF14+1)","v":""},null,{"$f":"+IF(DJ2=\"\",\"\",DH14+1)","v":""},null,{"$f":"+IF(DL2=\"\",\"\",DJ14+1)","v":""},null,{"$f":"+IF(DN2=\"\",\"\",DL14+1)","v":""},null,{"$f":"+IF(DP2=\"\",\"\",DN14+1)","v":""},null,{"$f":"+IF(DR2=\"\",\"\",DP14+1)","v":""},null,{"$f":"+IF(DT2=\"\",\"\",DR14+1)","v":""},null,{"$f":"+IF(DV2=\"\",\"\",DT14+1)","v":""},null,{"$f":"+IF(DX2=\"\",\"\",DV14+1)","v":""},null,{"$f":"+IF(DZ2=\"\",\"\",DX14+1)","v":""},null,{"$f":"+IF(EB2=\"\",\"\",DZ14+1)","v":""},null,{"$f":"+IF(ED2=\"\",\"\",EB14+1)","v":""},null,{"$f":"+IF(EF2=\"\",\"\",ED14+1)","v":""},null,{"$f":"+IF(EH2=\"\",\"\",EF14+1)","v":""},null,{"$f":"+IF(EJ2=\"\",\"\",EH14+1)","v":""},null,{"$f":"+IF(EL2=\"\",\"\",EJ14+1)","v":""},null,{"$f":"+IF(EN2=\"\",\"\",EL14+1)","v":""},null,{"$f":"+IF(EP2=\"\",\"\",EN14+1)","v":""},null,{"$f":"+IF(ER2=\"\",\"\",EP14+1)","v":""},null,{"$f":"+IF(ET2=\"\",\"\",ER14+1)","v":""},null,{"$f":"+IF(EV2=\"\",\"\",ET14+1)","v":""},null,{"$f":"+IF(EX2=\"\",\"\",EV14+1)","v":""},null,{"$f":"+IF(EZ2=\"\",\"\",EX14+1)","v":""},null,{"$f":"+IF(FB2=\"\",\"\",EZ14+1)","v":""},null,{"$f":"+IF(FD2=\"\",\"\",FB14+1)","v":""},null,{"$f":"+IF(FF2=\"\",\"\",FD14+1)","v":""},null,{"$f":"+IF(FH2=\"\",\"\",FF14+1)","v":""},null,{"$f":"+IF(FJ2=\"\",\"\",FH14+1)","v":""},null,{"$f":"+IF(FL2=\"\",\"\",FJ14+1)","v":""}]
[null,"Program Type",null,null,null,null,null,null,{"$f":"ROW(CCR_1!$A$16)","v":16},{"$f":"IF(J$2=\"\",\"\",INDIRECT(ADDRESS($I15,COLUMN(CCR_1!$J$1)+J$14-1,,,\"CCR_1\"))) & \"\"","v":""},null,{"$f":"IF(L$2=\"\",\"\",INDIRECT(ADDRESS($I15,COLUMN(CCR_1!$J$1)+L$14-1,,,\"CCR_1\"))) & \"\"","v":""},null,{"$f":"IF(N$2=\"\",\"\",INDIRECT(ADDRESS($I15,COLUMN(CCR_1!$J$1)+N$14-1,,,\"CCR_1\"))) & \"\"","v":""},null,{"$f":"IF(P$2=\"\",\"\",INDIRECT(ADDRESS($I15,COLUMN(CCR_1!$J$1)+P$14-1,,,\"CCR_1\"))) & \"\"","v":""},null,{"$f":"IF(R$2=\"\",\"\",INDIRECT(ADDRESS($I15,COLUMN(CCR_1!$J$1)+R$14-1,,,\"CCR_1\"))) & \"\"","v":""},null,{"$f":"IF(T$2=\"\",\"\",INDIRECT(ADDRESS($I15,COLUMN(CCR_1!$J$1)+T$14-1,,,\"CCR_1\"))) & \"\"","v":""},null,{"$f":"IF(V$2=\"\",\"\",INDIRECT(ADDRESS($I15,COLUMN(CCR_1!$J$1)+V$14-1,,,\"CCR_1\"))) & \"\"","v":""},null,{"$f":"IF(X$2=\"\",\"\",INDIRECT(ADDRESS($I15,COLUMN(CCR_1!$J$1)+X$14-1,,,\"CCR_1\"))) & \"\"","v":""},null,{"$f":"IF(Z$2=\"\",\"\",INDIRECT(ADDRESS($I15,COLUMN(CCR_1!$J$1)+Z$14-1,,,\"CCR_1\"))) & \"\"","v":""},null,{"$f":"IF(AB$2=\"\",\"\",INDIRECT(ADDRESS($I15,COLUMN(CCR_1!$J$1)+AB$14-1,,,\"CCR_1\"))) & \"\"","v":""},null,{"$f":"IF(AD$2=\"\",\"\",INDIRECT(ADDRESS($I15,COLUMN(CCR_1!$J$1)+AD$14-1,,,\"CCR_1\"))) & \"\"","v":""},null,{"$f":"IF(AF$2=\"\",\"\",INDIRECT(ADDRESS($I15,COLUMN(CCR_1!$J$1)+AF$14-1,,,\"CCR_1\"))) & \"\"","v":""},null,{"$f":"IF(AH$2=\"\",\"\",INDIRECT(ADDRESS($I15,COLUMN(CCR_1!$J$1)+AH$14-1,,,\"CCR_1\"))) & \"\"","v":""},null,{"$f":"IF(AJ$2=\"\",\"\",INDIRECT(ADDRESS($I15,COLUMN(CCR_1!$J$1)+AJ$14-1,,,\"CCR_1\"))) & \"\"","v":""},null,{"$f":"IF(AL$2=\"\",\"\",INDIRECT(ADDRESS($I15,COLUMN(CCR_1!$J$1)+AL$14-1,,,\"CCR_1\"))) & \"\"","v":""},null,{"$f":"IF(AN$2=\"\",\"\",INDIRECT(ADDRESS($I15,COLUMN(CCR_1!$J$1)+AN$14-1,,,\"CCR_1\"))) & \"\"","v":""},null,{"$f":"IF(AP$2=\"\",\"\",INDIRECT(ADDRESS($I15,COLUMN(CCR_1!$J$1)+AP$14-1,,,\"CCR_1\"))) & \"\"","v":""},null,{"$f":"IF(AR$2=\"\",\"\",INDIRECT(ADDRESS($I15,COLUMN(CCR_1!$J$1)+AR$14-1,,,\"CCR_1\"))) & \"\"","v":""},null,{"$f":"IF(AT$2=\"\",\"\",INDIRECT(ADDRESS($I15,COLUMN(CCR_1!$J$1)+AT$14-1,,,\"CCR_1\"))) & \"\"","v":""},null,{"$f":"IF(AV$2=\"\",\"\",INDIRECT(ADDRESS($I15,COLUMN(CCR_1!$J$1)+AV$14-1,,,\"CCR_1\"))) & \"\"","v":""},null,{"$f":"IF(AX$2=\"\",\"\",INDIRECT(ADDRESS($I15,COLUMN(CCR_1!$J$1)+AX$14-1,,,\"CCR_1\"))) & \"\"","v":""},null,{"$f":"IF(AZ$2=\"\",\"\",INDIRECT(ADDRESS($I15,COLUMN(CCR_1!$J$1)+AZ$14-1,,,\"CCR_1\"))) & \"\"","v":""},null,{"$f":"IF(BB$2=\"\",\"\",INDIRECT(ADDRESS($I15,COLUMN(CCR_1!$J$1)+BB$14-1,,,\"CCR_1\"))) & \"\"","v":""},null,{"$f":"IF(BD$2=\"\",\"\",INDIRECT(ADDRESS($I15,COLUMN(CCR_1!$J$1)+BD$14-1,,,\"CCR_1\"))) & \"\"","v":""},null,{"$f":"IF(BF$2=\"\",\"\",INDIRECT(ADDRESS($I15,COLUMN(CCR_1!$J$1)+BF$14-1,,,\"CCR_1\"))) & \"\"","v":""},null,{"$f":"IF(BH$2=\"\",\"\",INDIRECT(ADDRESS($I15,COLUMN(CCR_1!$J$1)+BH$14-1,,,\"CCR_1\"))) & \"\"","v":""},null,{"$f":"IF(BJ$2=\"\",\"\",INDIRECT(ADDRESS($I15,COLUMN(CCR_1!$J$1)+BJ$14-1,,,\"CCR_1\"))) & \"\"","v":""},null,{"$f":"IF(BL$2=\"\",\"\",INDIRECT(ADDRESS($I15,COLUMN(CCR_1!$J$1)+BL$14-1,,,\"CCR_1\"))) & \"\"","v":""},null,{"$f":"IF(BN$2=\"\",\"\",INDIRECT(ADDRESS($I15,COLUMN(CCR_1!$J$1)+BN$14-1,,,\"CCR_1\"))) & \"\"","v":""},null,{"$f":"IF(BP$2=\"\",\"\",INDIRECT(ADDRESS($I15,COLUMN(CCR_1!$J$1)+BP$14-1,,,\"CCR_1\"))) & \"\"","v":""},null,{"$f":"IF(BR$2=\"\",\"\",INDIRECT(ADDRESS($I15,COLUMN(CCR_1!$J$1)+BR$14-1,,,\"CCR_1\"))) & \"\"","v":""},null,{"$f":"IF(BT$2=\"\",\"\",INDIRECT(ADDRESS($I15,COLUMN(CCR_1!$J$1)+BT$14-1,,,\"CCR_1\"))) & \"\"","v":""},null,{"$f":"IF(BV$2=\"\",\"\",INDIRECT(ADDRESS($I15,COLUMN(CCR_1!$J$1)+BV$14-1,,,\"CCR_1\"))) & \"\"","v":""},null,{"$f":"IF(BX$2=\"\",\"\",INDIRECT(ADDRESS($I15,COLUMN(CCR_1!$J$1)+BX$14-1,,,\"CCR_1\"))) & \"\"","v":""},null,{"$f":"IF(BZ$2=\"\",\"\",INDIRECT(ADDRESS($I15,COLUMN(CCR_1!$J$1)+BZ$14-1,,,\"CCR_1\"))) & \"\"","v":""},null,{"$f":"IF(CB$2=\"\",\"\",INDIRECT(ADDRESS($I15,COLUMN(CCR_1!$J$1)+CB$14-1,,,\"CCR_1\"))) & \"\"","v":""},null,{"$f":"IF(CD$2=\"\",\"\",INDIRECT(ADDRESS($I15,COLUMN(CCR_1!$J$1)+CD$14-1,,,\"CCR_1\"))) & \"\"","v":""},null,{"$f":"IF(CF$2=\"\",\"\",INDIRECT(ADDRESS($I15,COLUMN(CCR_1!$J$1)+CF$14-1,,,\"CCR_1\"))) & \"\"","v":""},null,{"$f":"IF(CH$2=\"\",\"\",INDIRECT(ADDRESS($I15,COLUMN(CCR_1!$J$1)+CH$14-1,,,\"CCR_1\"))) & \"\"","v":""},null,{"$f":"IF(CJ$2=\"\",\"\",INDIRECT(ADDRESS($I15,COLUMN(CCR_1!$J$1)+CJ$14-1,,,\"CFR_1\"))) & \"\"","v":""},null,{"$f":"IF(CL$2=\"\",\"\",INDIRECT(ADDRESS($I15,COLUMN(CCR_1!$J$1)+CL$14-1,,,\"CFR_1\"))) & \"\"","v":""},null,{"$f":"IF(CN$2=\"\",\"\",INDIRECT(ADDRESS($I15,COLUMN(CCR_1!$J$1)+CN$14-1,,,\"CFR_1\"))) & \"\"","v":""},null,{"$f":"IF(CP$2=\"\",\"\",INDIRECT(ADDRESS($I15,COLUMN(CCR_1!$J$1)+CP$14-1,,,\"CFR_1\"))) & \"\"","v":""},null,{"$f":"IF(CR$2=\"\",\"\",INDIRECT(ADDRESS($I15,COLUMN(CCR_1!$J$1)+CR$14-1,,,\"CFR_1\"))) & \"\"","v":""},null,{"$f":"IF(CT$2=\"\",\"\",INDIRECT(ADDRESS($I15,COLUMN(CCR_1!$J$1)+CT$14-1,,,\"CFR_1\"))) & \"\"","v":""},null,{"$f":"IF(CV$2=\"\",\"\",INDIRECT(ADDRESS($I15,COLUMN(CCR_1!$J$1)+CV$14-1,,,\"CFR_1\"))) & \"\"","v":""},null,{"$f":"IF(CX$2=\"\",\"\",INDIRECT(ADDRESS($I15,COLUMN(CCR_1!$J$1)+CX$14-1,,,\"CFR_1\"))) & \"\"","v":""},null,{"$f":"IF(CZ$2=\"\",\"\",INDIRECT(ADDRESS($I15,COLUMN(CCR_1!$J$1)+CZ$14-1,,,\"CFR_1\"))) & \"\"","v":""},null,{"$f":"IF(DB$2=\"\",\"\",INDIRECT(ADDRESS($I15,COLUMN(CCR_1!$J$1)+DB$14-1,,,\"CFR_1\"))) & \"\"","v":""},null,{"$f":"IF(DD$2=\"\",\"\",INDIRECT(ADDRESS($I15,COLUMN(CCR_1!$J$1)+DD$14-1,,,\"CFR_1\"))) & \"\"","v":""},null,{"$f":"IF(DF$2=\"\",\"\",INDIRECT(ADDRESS($I15,COLUMN(CCR_1!$J$1)+DF$14-1,,,\"CFR_1\"))) & \"\"","v":""},null,{"$f":"IF(DH$2=\"\",\"\",INDIRECT(ADDRESS($I15,COLUMN(CCR_1!$J$1)+DH$14-1,,,\"CFR_1\"))) & \"\"","v":""},null,{"$f":"IF(DJ$2=\"\",\"\",INDIRECT(ADDRESS($I15,COLUMN(CCR_1!$J$1)+DJ$14-1,,,\"CFR_1\"))) & \"\"","v":""},null,{"$f":"IF(DL$2=\"\",\"\",INDIRECT(ADDRESS($I15,COLUMN(CCR_1!$J$1)+DL$14-1,,,\"CFR_1\"))) & \"\"","v":""},null,{"$f":"IF(DN$2=\"\",\"\",INDIRECT(ADDRESS($I15,COLUMN(CCR_1!$J$1)+DN$14-1,,,\"CFR_1\"))) & \"\"","v":""},null,{"$f":"IF(DP$2=\"\",\"\",INDIRECT(ADDRESS($I15,COLUMN(CCR_1!$J$1)+DP$14-1,,,\"CFR_1\"))) & \"\"","v":""},null,{"$f":"IF(DR$2=\"\",\"\",INDIRECT(ADDRESS($I15,COLUMN(CCR_1!$J$1)+DR$14-1,,,\"CFR_1\"))) & \"\"","v":""},null,{"$f":"IF(DT$2=\"\",\"\",INDIRECT(ADDRESS($I15,COLUMN(CCR_1!$J$1)+DT$14-1,,,\"CFR_1\"))) & \"\"","v":""},null,{"$f":"IF(DV$2=\"\",\"\",INDIRECT(ADDRESS($I15,COLUMN(CCR_1!$J$1)+DV$14-1,,,\"CFR_1\"))) & \"\"","v":""},null,{"$f":"IF(DX$2=\"\",\"\",INDIRECT(ADDRESS($I15,COLUMN(CCR_1!$J$1)+DX$14-1,,,\"CFR_1\"))) & \"\"","v":""},null,{"$f":"IF(DZ$2=\"\",\"\",INDIRECT(ADDRESS($I15,COLUMN(CCR_1!$J$1)+DZ$14-1,,,\"CFR_1\"))) & \"\"","v":""},null,{"$f":"IF(EB$2=\"\",\"\",INDIRECT(ADDRESS($I15,COLUMN(CCR_1!$J$1)+EB$14-1,,,\"CFR_1\"))) & \"\"","v":""},null,{"$f":"IF(ED$2=\"\",\"\",INDIRECT(ADDRESS($I15,COLUMN(CCR_1!$J$1)+ED$14-1,,,\"CFR_1\"))) & \"\"","v":""},null,{"$f":"IF(EF$2=\"\",\"\",INDIRECT(ADDRESS($I15,COLUMN(CCR_1!$J$1)+EF$14-1,,,\"CFR_1\"))) & \"\"","v":""},null,{"$f":"IF(EH$2=\"\",\"\",INDIRECT(ADDRESS($I15,COLUMN(CCR_1!$J$1)+EH$14-1,,,\"CFR_1\"))) & \"\"","v":""},null,{"$f":"IF(EJ$2=\"\",\"\",INDIRECT(ADDRESS($I15,COLUMN(CCR_1!$J$1)+EJ$14-1,,,\"CFR_1\"))) & \"\"","v":""},null,{"$f":"IF(EL$2=\"\",\"\",INDIRECT(ADDRESS($I15,COLUMN(CCR_1!$J$1)+EL$14-1,,,\"CFR_1\"))) & \"\"","v":""},null,{"$f":"IF(EN$2=\"\",\"\",INDIRECT(ADDRESS($I15,COLUMN(CCR_1!$J$1)+EN$14-1,,,\"CFR_1\"))) & \"\"","v":""},null,{"$f":"IF(EP$2=\"\",\"\",INDIRECT(ADDRESS($I15,COLUMN(CCR_1!$J$1)+EP$14-1,,,\"CFR_1\"))) & \"\"","v":""},null,{"$f":"IF(ER$2=\"\",\"\",INDIRECT(ADDRESS($I15,COLUMN(CCR_1!$J$1)+ER$14-1,,,\"CFR_1\"))) & \"\"","v":""},null,{"$f":"IF(ET$2=\"\",\"\",INDIRECT(ADDRESS($I15,COLUMN(CCR_1!$J$1)+ET$14-1,,,\"CFR_1\"))) & \"\"","v":""},null,{"$f":"IF(EV$2=\"\",\"\",INDIRECT(ADDRESS($I15,COLUMN(CCR_1!$J$1)+EV$14-1,,,\"CFR_1\"))) & \"\"","v":""},null,{"$f":"IF(EX$2=\"\",\"\",INDIRECT(ADDRESS($I15,COLUMN(CCR_1!$J$1)+EX$14-1,,,\"CFR_1\"))) & \"\"","v":""},null,{"$f":"IF(EZ$2=\"\",\"\",INDIRECT(ADDRESS($I15,COLUMN(CCR_1!$J$1)+EZ$14-1,,,\"CFR_1\"))) & \"\"","v":""},null,{"$f":"IF(FB$2=\"\",\"\",INDIRECT(ADDRESS($I15,COLUMN(CCR_1!$J$1)+FB$14-1,,,\"CFR_1\"))) & \"\"","v":""},null,{"$f":"IF(FD$2=\"\",\"\",INDIRECT(ADDRESS($I15,COLUMN(CCR_1!$J$1)+FD$14-1,,,\"CFR_1\"))) & \"\"","v":""},null,{"$f":"IF(FF$2=\"\",\"\",INDIRECT(ADDRESS($I15,COLUMN(CCR_1!$J$1)+FF$14-1,,,\"CFR_1\"))) & \"\"","v":""},null,{"$f":"IF(FH$2=\"\",\"\",INDIRECT(ADDRESS($I15,COLUMN(CCR_1!$J$1)+FH$14-1,,,\"CFR_1\"))) & \"\"","v":""},null,{"$f":"IF(FJ$2=\"\",\"\",INDIRECT(ADDRESS($I15,COLUMN(CCR_1!$J$1)+FJ$14-1,,,\"CFR_1\"))) & \"\"","v":""},null,{"$f":"IF(FL$2=\"\",\"\",INDIRECT(ADDRESS($I15,COLUMN(CCR_1!$J$1)+FL$14-1,,,\"CFR_1\"))) & \"\"","v":""}]
[null,"PROGRAM CODE ** (PROGRAM CODE INDEX)",null,null,null,null,null,null,{"$f":"ROW(CCR_1!$A$17)","v":17},{"$f":"IF(J$2=\"\",\"\",INDIRECT(ADDRESS($I16,COLUMN(CCR_1!$J$1)+J$14-1,,,\"CCR_1\"))) & \"\"","v":""},null,{"$f":"IF(L$2=\"\",\"\",INDIRECT(ADDRESS($I16,COLUMN(CCR_1!$J$1)+L$14-1,,,\"CCR_1\"))) & \"\"","v":""},null,{"$f":"IF(N$2=\"\",\"\",INDIRECT(ADDRESS($I16,COLUMN(CCR_1!$J$1)+N$14-1,,,\"CCR_1\"))) & \"\"","v":""},null,{"$f":"IF(P$2=\"\",\"\",INDIRECT(ADDRESS($I16,COLUMN(CCR_1!$J$1)+P$14-1,,,\"CCR_1\"))) & \"\"","v":""},null,{"$f":"IF(R$2=\"\",\"\",INDIRECT(ADDRESS($I16,COLUMN(CCR_1!$J$1)+R$14-1,,,\"CCR_1\"))) & \"\"","v":""},null,{"$f":"IF(T$2=\"\",\"\",INDIRECT(ADDRESS($I16,COLUMN(CCR_1!$J$1)+T$14-1,,,\"CCR_1\"))) & \"\"","v":""},null,{"$f":"IF(V$2=\"\",\"\",INDIRECT(ADDRESS($I16,COLUMN(CCR_1!$J$1)+V$14-1,,,\"CCR_1\"))) & \"\"","v":""},null,{"$f":"IF(X$2=\"\",\"\",INDIRECT(ADDRESS($I16,COLUMN(CCR_1!$J$1)+X$14-1,,,\"CCR_1\"))) & \"\"","v":""},null,{"$f":"IF(Z$2=\"\",\"\",INDIRECT(ADDRESS($I16,COLUMN(CCR_1!$J$1)+Z$14-1,,,\"CCR_1\"))) & \"\"","v":""},null,{"$f":"IF(AB$2=\"\",\"\",INDIRECT(ADDRESS($I16,COLUMN(CCR_1!$J$1)+AB$14-1,,,\"CCR_1\"))) & \"\"","v":""},null,{"$f":"IF(AD$2=\"\",\"\",INDIRECT(ADDRESS($I16,COLUMN(CCR_1!$J$1)+AD$14-1,,,\"CCR_1\"))) & \"\"","v":""},null,{"$f":"IF(AF$2=\"\",\"\",INDIRECT(ADDRESS($I16,COLUMN(CCR_1!$J$1)+AF$14-1,,,\"CCR_1\"))) & \"\"","v":""},null,{"$f":"IF(AH$2=\"\",\"\",INDIRECT(ADDRESS($I16,COLUMN(CCR_1!$J$1)+AH$14-1,,,\"CCR_1\"))) & \"\"","v":""},null,{"$f":"IF(AJ$2=\"\",\"\",INDIRECT(ADDRESS($I16,COLUMN(CCR_1!$J$1)+AJ$14-1,,,\"CCR_1\"))) & \"\"","v":""},null,{"$f":"IF(AL$2=\"\",\"\",INDIRECT(ADDRESS($I16,COLUMN(CCR_1!$J$1)+AL$14-1,,,\"CCR_1\"))) & \"\"","v":""},null,{"$f":"IF(AN$2=\"\",\"\",INDIRECT(ADDRESS($I16,COLUMN(CCR_1!$J$1)+AN$14-1,,,\"CCR_1\"))) & \"\"","v":""},null,{"$f":"IF(AP$2=\"\",\"\",INDIRECT(ADDRESS($I16,COLUMN(CCR_1!$J$1)+AP$14-1,,,\"CCR_1\"))) & \"\"","v":""},null,{"$f":"IF(AR$2=\"\",\"\",INDIRECT(ADDRESS($I16,COLUMN(CCR_1!$J$1)+AR$14-1,,,\"CCR_1\"))) & \"\"","v":""},null,{"$f":"IF(AT$2=\"\",\"\",INDIRECT(ADDRESS($I16,COLUMN(CCR_1!$J$1)+AT$14-1,,,\"CCR_1\"))) & \"\"","v":""},null,{"$f":"IF(AV$2=\"\",\"\",INDIRECT(ADDRESS($I16,COLUMN(CCR_1!$J$1)+AV$14-1,,,\"CCR_1\"))) & \"\"","v":""},null,{"$f":"IF(AX$2=\"\",\"\",INDIRECT(ADDRESS($I16,COLUMN(CCR_1!$J$1)+AX$14-1,,,\"CCR_1\"))) & \"\"","v":""},null,{"$f":"IF(AZ$2=\"\",\"\",INDIRECT(ADDRESS($I16,COLUMN(CCR_1!$J$1)+AZ$14-1,,,\"CCR_1\"))) & \"\"","v":""},null,{"$f":"IF(BB$2=\"\",\"\",INDIRECT(ADDRESS($I16,COLUMN(CCR_1!$J$1)+BB$14-1,,,\"CCR_1\"))) & \"\"","v":""},null,{"$f":"IF(BD$2=\"\",\"\",INDIRECT(ADDRESS($I16,COLUMN(CCR_1!$J$1)+BD$14-1,,,\"CCR_1\"))) & \"\"","v":""},null,{"$f":"IF(BF$2=\"\",\"\",INDIRECT(ADDRESS($I16,COLUMN(CCR_1!$J$1)+BF$14-1,,,\"CCR_1\"))) & \"\"","v":""},null,{"$f":"IF(BH$2=\"\",\"\",INDIRECT(ADDRESS($I16,COLUMN(CCR_1!$J$1)+BH$14-1,,,\"CCR_1\"))) & \"\"","v":""},null,{"$f":"IF(BJ$2=\"\",\"\",INDIRECT(ADDRESS($I16,COLUMN(CCR_1!$J$1)+BJ$14-1,,,\"CCR_1\"))) & \"\"","v":""},null,{"$f":"IF(BL$2=\"\",\"\",INDIRECT(ADDRESS($I16,COLUMN(CCR_1!$J$1)+BL$14-1,,,\"CCR_1\"))) & \"\"","v":""},null,{"$f":"IF(BN$2=\"\",\"\",INDIRECT(ADDRESS($I16,COLUMN(CCR_1!$J$1)+BN$14-1,,,\"CCR_1\"))) & \"\"","v":""},null,{"$f":"IF(BP$2=\"\",\"\",INDIRECT(ADDRESS($I16,COLUMN(CCR_1!$J$1)+BP$14-1,,,\"CCR_1\"))) & \"\"","v":""},null,{"$f":"IF(BR$2=\"\",\"\",INDIRECT(ADDRESS($I16,COLUMN(CCR_1!$J$1)+BR$14-1,,,\"CCR_1\"))) & \"\"","v":""},null,{"$f":"IF(BT$2=\"\",\"\",INDIRECT(ADDRESS($I16,COLUMN(CCR_1!$J$1)+BT$14-1,,,\"CCR_1\"))) & \"\"","v":""},null,{"$f":"IF(BV$2=\"\",\"\",INDIRECT(ADDRESS($I16,COLUMN(CCR_1!$J$1)+BV$14-1,,,\"CCR_1\"))) & \"\"","v":""},null,{"$f":"IF(BX$2=\"\",\"\",INDIRECT(ADDRESS($I16,COLUMN(CCR_1!$J$1)+BX$14-1,,,\"CCR_1\"))) & \"\"","v":""},null,{"$f":"IF(BZ$2=\"\",\"\",INDIRECT(ADDRESS($I16,COLUMN(CCR_1!$J$1)+BZ$14-1,,,\"CCR_1\"))) & \"\"","v":""},null,{"$f":"IF(CB$2=\"\",\"\",INDIRECT(ADDRESS($I16,COLUMN(CCR_1!$J$1)+CB$14-1,,,\"CCR_1\"))) & \"\"","v":""},null,{"$f":"IF(CD$2=\"\",\"\",INDIRECT(ADDRESS($I16,COLUMN(CCR_1!$J$1)+CD$14-1,,,\"CCR_1\"))) & \"\"","v":""},null,{"$f":"IF(CF$2=\"\",\"\",INDIRECT(ADDRESS($I16,COLUMN(CCR_1!$J$1)+CF$14-1,,,\"CCR_1\"))) & \"\"","v":""},null,{"$f":"IF(CH$2=\"\",\"\",INDIRECT(ADDRESS($I16,COLUMN(CCR_1!$J$1)+CH$14-1,,,\"CCR_1\"))) & \"\"","v":""},null,{"$f":"IF(CJ$2=\"\",\"\",INDIRECT(ADDRESS($I16,COLUMN(CCR_1!$J$1)+CJ$14-1,,,\"CFR_1\"))) & \"\"","v":""},null,{"$f":"IF(CL$2=\"\",\"\",INDIRECT(ADDRESS($I16,COLUMN(CCR_1!$J$1)+CL$14-1,,,\"CFR_1\"))) & \"\"","v":""},null,{"$f":"IF(CN$2=\"\",\"\",INDIRECT(ADDRESS($I16,COLUMN(CCR_1!$J$1)+CN$14-1,,,\"CFR_1\"))) & \"\"","v":""},null,{"$f":"IF(CP$2=\"\",\"\",INDIRECT(ADDRESS($I16,COLUMN(CCR_1!$J$1)+CP$14-1,,,\"CFR_1\"))) & \"\"","v":""},null,{"$f":"IF(CR$2=\"\",\"\",INDIRECT(ADDRESS($I16,COLUMN(CCR_1!$J$1)+CR$14-1,,,\"CFR_1\"))) & \"\"","v":""},null,{"$f":"IF(CT$2=\"\",\"\",INDIRECT(ADDRESS($I16,COLUMN(CCR_1!$J$1)+CT$14-1,,,\"CFR_1\"))) & \"\"","v":""},null,{"$f":"IF(CV$2=\"\",\"\",INDIRECT(ADDRESS($I16,COLUMN(CCR_1!$J$1)+CV$14-1,,,\"CFR_1\"))) & \"\"","v":""},null,{"$f":"IF(CX$2=\"\",\"\",INDIRECT(ADDRESS($I16,COLUMN(CCR_1!$J$1)+CX$14-1,,,\"CFR_1\"))) & \"\"","v":""},null,{"$f":"IF(CZ$2=\"\",\"\",INDIRECT(ADDRESS($I16,COLUMN(CCR_1!$J$1)+CZ$14-1,,,\"CFR_1\"))) & \"\"","v":""},null,{"$f":"IF(DB$2=\"\",\"\",INDIRECT(ADDRESS($I16,COLUMN(CCR_1!$J$1)+DB$14-1,,,\"CFR_1\"))) & \"\"","v":""},null,{"$f":"IF(DD$2=\"\",\"\",INDIRECT(ADDRESS($I16,COLUMN(CCR_1!$J$1)+DD$14-1,,,\"CFR_1\"))) & \"\"","v":""},null,{"$f":"IF(DF$2=\"\",\"\",INDIRECT(ADDRESS($I16,COLUMN(CCR_1!$J$1)+DF$14-1,,,\"CFR_1\"))) & \"\"","v":""},null,{"$f":"IF(DH$2=\"\",\"\",INDIRECT(ADDRESS($I16,COLUMN(CCR_1!$J$1)+DH$14-1,,,\"CFR_1\"))) & \"\"","v":""},null,{"$f":"IF(DJ$2=\"\",\"\",INDIRECT(ADDRESS($I16,COLUMN(CCR_1!$J$1)+DJ$14-1,,,\"CFR_1\"))) & \"\"","v":""},null,{"$f":"IF(DL$2=\"\",\"\",INDIRECT(ADDRESS($I16,COLUMN(CCR_1!$J$1)+DL$14-1,,,\"CFR_1\"))) & \"\"","v":""},null,{"$f":"IF(DN$2=\"\",\"\",INDIRECT(ADDRESS($I16,COLUMN(CCR_1!$J$1)+DN$14-1,,,\"CFR_1\"))) & \"\"","v":""},null,{"$f":"IF(DP$2=\"\",\"\",INDIRECT(ADDRESS($I16,COLUMN(CCR_1!$J$1)+DP$14-1,,,\"CFR_1\"))) & \"\"","v":""},null,{"$f":"IF(DR$2=\"\",\"\",INDIRECT(ADDRESS($I16,COLUMN(CCR_1!$J$1)+DR$14-1,,,\"CFR_1\"))) & \"\"","v":""},null,{"$f":"IF(DT$2=\"\",\"\",INDIRECT(ADDRESS($I16,COLUMN(CCR_1!$J$1)+DT$14-1,,,\"CFR_1\"))) & \"\"","v":""},null,{"$f":"IF(DV$2=\"\",\"\",INDIRECT(ADDRESS($I16,COLUMN(CCR_1!$J$1)+DV$14-1,,,\"CFR_1\"))) & \"\"","v":""},null,{"$f":"IF(DX$2=\"\",\"\",INDIRECT(ADDRESS($I16,COLUMN(CCR_1!$J$1)+DX$14-1,,,\"CFR_1\"))) & \"\"","v":""},null,{"$f":"IF(DZ$2=\"\",\"\",INDIRECT(ADDRESS($I16,COLUMN(CCR_1!$J$1)+DZ$14-1,,,\"CFR_1\"))) & \"\"","v":""},null,{"$f":"IF(EB$2=\"\",\"\",INDIRECT(ADDRESS($I16,COLUMN(CCR_1!$J$1)+EB$14-1,,,\"CFR_1\"))) & \"\"","v":""},null,{"$f":"IF(ED$2=\"\",\"\",INDIRECT(ADDRESS($I16,COLUMN(CCR_1!$J$1)+ED$14-1,,,\"CFR_1\"))) & \"\"","v":""},null,{"$f":"IF(EF$2=\"\",\"\",INDIRECT(ADDRESS($I16,COLUMN(CCR_1!$J$1)+EF$14-1,,,\"CFR_1\"))) & \"\"","v":""},null,{"$f":"IF(EH$2=\"\",\"\",INDIRECT(ADDRESS($I16,COLUMN(CCR_1!$J$1)+EH$14-1,,,\"CFR_1\"))) & \"\"","v":""},null,{"$f":"IF(EJ$2=\"\",\"\",INDIRECT(ADDRESS($I16,COLUMN(CCR_1!$J$1)+EJ$14-1,,,\"CFR_1\"))) & \"\"","v":""},null,{"$f":"IF(EL$2=\"\",\"\",INDIRECT(ADDRESS($I16,COLUMN(CCR_1!$J$1)+EL$14-1,,,\"CFR_1\"))) & \"\"","v":""},null,{"$f":"IF(EN$2=\"\",\"\",INDIRECT(ADDRESS($I16,COLUMN(CCR_1!$J$1)+EN$14-1,,,\"CFR_1\"))) & \"\"","v":""},null,{"$f":"IF(EP$2=\"\",\"\",INDIRECT(ADDRESS($I16,COLUMN(CCR_1!$J$1)+EP$14-1,,,\"CFR_1\"))) & \"\"","v":""},null,{"$f":"IF(ER$2=\"\",\"\",INDIRECT(ADDRESS($I16,COLUMN(CCR_1!$J$1)+ER$14-1,,,\"CFR_1\"))) & \"\"","v":""},null,{"$f":"IF(ET$2=\"\",\"\",INDIRECT(ADDRESS($I16,COLUMN(CCR_1!$J$1)+ET$14-1,,,\"CFR_1\"))) & \"\"","v":""},null,{"$f":"IF(EV$2=\"\",\"\",INDIRECT(ADDRESS($I16,COLUMN(CCR_1!$J$1)+EV$14-1,,,\"CFR_1\"))) & \"\"","v":""},null,{"$f":"IF(EX$2=\"\",\"\",INDIRECT(ADDRESS($I16,COLUMN(CCR_1!$J$1)+EX$14-1,,,\"CFR_1\"))) & \"\"","v":""},null,{"$f":"IF(EZ$2=\"\",\"\",INDIRECT(ADDRESS($I16,COLUMN(CCR_1!$J$1)+EZ$14-1,,,\"CFR_1\"))) & \"\"","v":""},null,{"$f":"IF(FB$2=\"\",\"\",INDIRECT(ADDRESS($I16,COLUMN(CCR_1!$J$1)+FB$14-1,,,\"CFR_1\"))) & \"\"","v":""},null,{"$f":"IF(FD$2=\"\",\"\",INDIRECT(ADDRESS($I16,COLUMN(CCR_1!$J$1)+FD$14-1,,,\"CFR_1\"))) & \"\"","v":""},null,{"$f":"IF(FF$2=\"\",\"\",INDIRECT(ADDRESS($I16,COLUMN(CCR_1!$J$1)+FF$14-1,,,\"CFR_1\"))) & \"\"","v":""},null,{"$f":"IF(FH$2=\"\",\"\",INDIRECT(ADDRESS($I16,COLUMN(CCR_1!$J$1)+FH$14-1,,,\"CFR_1\"))) & \"\"","v":""},null,{"$f":"IF(FJ$2=\"\",\"\",INDIRECT(ADDRESS($I16,COLUMN(CCR_1!$J$1)+FJ$14-1,,,\"CFR_1\"))) & \"\"","v":""},null,{"$f":"IF(FL$2=\"\",\"\",INDIRECT(ADDRESS($I16,COLUMN(CCR_1!$J$1)+FL$14-1,,,\"CFR_1\"))) & \"\"","v":""}]
[null,"PROGRAM/SITE NAME",null,null,null,null,null,null,{"$f":"ROW(CCR_1!$A$19)","v":19},{"$f":"IF(J$2=\"\",\"\",INDIRECT(ADDRESS($I17,COLUMN(CCR_1!$J$1)+J$14-1,,,\"CCR_1\"))) & \"\"","v":""},null,{"$f":"IF(L$2=\"\",\"\",INDIRECT(ADDRESS($I17,COLUMN(CCR_1!$J$1)+L$14-1,,,\"CCR_1\"))) & \"\"","v":""},null,{"$f":"IF(N$2=\"\",\"\",INDIRECT(ADDRESS($I17,COLUMN(CCR_1!$J$1)+N$14-1,,,\"CCR_1\"))) & \"\"","v":""},null,{"$f":"IF(P$2=\"\",\"\",INDIRECT(ADDRESS($I17,COLUMN(CCR_1!$J$1)+P$14-1,,,\"CCR_1\"))) & \"\"","v":""},null,{"$f":"IF(R$2=\"\",\"\",INDIRECT(ADDRESS($I17,COLUMN(CCR_1!$J$1)+R$14-1,,,\"CCR_1\"))) & \"\"","v":""},null,{"$f":"IF(T$2=\"\",\"\",INDIRECT(ADDRESS($I17,COLUMN(CCR_1!$J$1)+T$14-1,,,\"CCR_1\"))) & \"\"","v":""},null,{"$f":"IF(V$2=\"\",\"\",INDIRECT(ADDRESS($I17,COLUMN(CCR_1!$J$1)+V$14-1,,,\"CCR_1\"))) & \"\"","v":""},null,{"$f":"IF(X$2=\"\",\"\",INDIRECT(ADDRESS($I17,COLUMN(CCR_1!$J$1)+X$14-1,,,\"CCR_1\"))) & \"\"","v":""},null,{"$f":"IF(Z$2=\"\",\"\",INDIRECT(ADDRESS($I17,COLUMN(CCR_1!$J$1)+Z$14-1,,,\"CCR_1\"))) & \"\"","v":""},null,{"$f":"IF(AB$2=\"\",\"\",INDIRECT(ADDRESS($I17,COLUMN(CCR_1!$J$1)+AB$14-1,,,\"CCR_1\"))) & \"\"","v":""},null,{"$f":"IF(AD$2=\"\",\"\",INDIRECT(ADDRESS($I17,COLUMN(CCR_1!$J$1)+AD$14-1,,,\"CCR_1\"))) & \"\"","v":""},null,{"$f":"IF(AF$2=\"\",\"\",INDIRECT(ADDRESS($I17,COLUMN(CCR_1!$J$1)+AF$14-1,,,\"CCR_1\"))) & \"\"","v":""},null,{"$f":"IF(AH$2=\"\",\"\",INDIRECT(ADDRESS($I17,COLUMN(CCR_1!$J$1)+AH$14-1,,,\"CCR_1\"))) & \"\"","v":""},null,{"$f":"IF(AJ$2=\"\",\"\",INDIRECT(ADDRESS($I17,COLUMN(CCR_1!$J$1)+AJ$14-1,,,\"CCR_1\"))) & \"\"","v":""},null,{"$f":"IF(AL$2=\"\",\"\",INDIRECT(ADDRESS($I17,COLUMN(CCR_1!$J$1)+AL$14-1,,,\"CCR_1\"))) & \"\"","v":""},null,{"$f":"IF(AN$2=\"\",\"\",INDIRECT(ADDRESS($I17,COLUMN(CCR_1!$J$1)+AN$14-1,,,\"CCR_1\"))) & \"\"","v":""},null,{"$f":"IF(AP$2=\"\",\"\",INDIRECT(ADDRESS($I17,COLUMN(CCR_1!$J$1)+AP$14-1,,,\"CCR_1\"))) & \"\"","v":""},null,{"$f":"IF(AR$2=\"\",\"\",INDIRECT(ADDRESS($I17,COLUMN(CCR_1!$J$1)+AR$14-1,,,\"CCR_1\"))) & \"\"","v":""},null,{"$f":"IF(AT$2=\"\",\"\",INDIRECT(ADDRESS($I17,COLUMN(CCR_1!$J$1)+AT$14-1,,,\"CCR_1\"))) & \"\"","v":""},null,{"$f":"IF(AV$2=\"\",\"\",INDIRECT(ADDRESS($I17,COLUMN(CCR_1!$J$1)+AV$14-1,,,\"CCR_1\"))) & \"\"","v":""},null,{"$f":"IF(AX$2=\"\",\"\",INDIRECT(ADDRESS($I17,COLUMN(CCR_1!$J$1)+AX$14-1,,,\"CCR_1\"))) & \"\"","v":""},null,{"$f":"IF(AZ$2=\"\",\"\",INDIRECT(ADDRESS($I17,COLUMN(CCR_1!$J$1)+AZ$14-1,,,\"CCR_1\"))) & \"\"","v":""},null,{"$f":"IF(BB$2=\"\",\"\",INDIRECT(ADDRESS($I17,COLUMN(CCR_1!$J$1)+BB$14-1,,,\"CCR_1\"))) & \"\"","v":""},null,{"$f":"IF(BD$2=\"\",\"\",INDIRECT(ADDRESS($I17,COLUMN(CCR_1!$J$1)+BD$14-1,,,\"CCR_1\"))) & \"\"","v":""},null,{"$f":"IF(BF$2=\"\",\"\",INDIRECT(ADDRESS($I17,COLUMN(CCR_1!$J$1)+BF$14-1,,,\"CCR_1\"))) & \"\"","v":""},null,{"$f":"IF(BH$2=\"\",\"\",INDIRECT(ADDRESS($I17,COLUMN(CCR_1!$J$1)+BH$14-1,,,\"CCR_1\"))) & \"\"","v":""},null,{"$f":"IF(BJ$2=\"\",\"\",INDIRECT(ADDRESS($I17,COLUMN(CCR_1!$J$1)+BJ$14-1,,,\"CCR_1\"))) & \"\"","v":""},null,{"$f":"IF(BL$2=\"\",\"\",INDIRECT(ADDRESS($I17,COLUMN(CCR_1!$J$1)+BL$14-1,,,\"CCR_1\"))) & \"\"","v":""},null,{"$f":"IF(BN$2=\"\",\"\",INDIRECT(ADDRESS($I17,COLUMN(CCR_1!$J$1)+BN$14-1,,,\"CCR_1\"))) & \"\"","v":""},null,{"$f":"IF(BP$2=\"\",\"\",INDIRECT(ADDRESS($I17,COLUMN(CCR_1!$J$1)+BP$14-1,,,\"CCR_1\"))) & \"\"","v":""},null,{"$f":"IF(BR$2=\"\",\"\",INDIRECT(ADDRESS($I17,COLUMN(CCR_1!$J$1)+BR$14-1,,,\"CCR_1\"))) & \"\"","v":""},null,{"$f":"IF(BT$2=\"\",\"\",INDIRECT(ADDRESS($I17,COLUMN(CCR_1!$J$1)+BT$14-1,,,\"CCR_1\"))) & \"\"","v":""},null,{"$f":"IF(BV$2=\"\",\"\",INDIRECT(ADDRESS($I17,COLUMN(CCR_1!$J$1)+BV$14-1,,,\"CCR_1\"))) & \"\"","v":""},null,{"$f":"IF(BX$2=\"\",\"\",INDIRECT(ADDRESS($I17,COLUMN(CCR_1!$J$1)+BX$14-1,,,\"CCR_1\"))) & \"\"","v":""},null,{"$f":"IF(BZ$2=\"\",\"\",INDIRECT(ADDRESS($I17,COLUMN(CCR_1!$J$1)+BZ$14-1,,,\"CCR_1\"))) & \"\"","v":""},null,{"$f":"IF(CB$2=\"\",\"\",INDIRECT(ADDRESS($I17,COLUMN(CCR_1!$J$1)+CB$14-1,,,\"CCR_1\"))) & \"\"","v":""},null,{"$f":"IF(CD$2=\"\",\"\",INDIRECT(ADDRESS($I17,COLUMN(CCR_1!$J$1)+CD$14-1,,,\"CCR_1\"))) & \"\"","v":""},null,{"$f":"IF(CF$2=\"\",\"\",INDIRECT(ADDRESS($I17,COLUMN(CCR_1!$J$1)+CF$14-1,,,\"CCR_1\"))) & \"\"","v":""},null,{"$f":"IF(CH$2=\"\",\"\",INDIRECT(ADDRESS($I17,COLUMN(CCR_1!$J$1)+CH$14-1,,,\"CCR_1\"))) & \"\"","v":""},null,{"$f":"IF(CJ$2=\"\",\"\",INDIRECT(ADDRESS($I17,COLUMN(CCR_1!$J$1)+CJ$14-1,,,\"CFR_1\"))) & \"\"","v":""},null,{"$f":"IF(CL$2=\"\",\"\",INDIRECT(ADDRESS($I17,COLUMN(CCR_1!$J$1)+CL$14-1,,,\"CFR_1\"))) & \"\"","v":""},null,{"$f":"IF(CN$2=\"\",\"\",INDIRECT(ADDRESS($I17,COLUMN(CCR_1!$J$1)+CN$14-1,,,\"CFR_1\"))) & \"\"","v":""},null,{"$f":"IF(CP$2=\"\",\"\",INDIRECT(ADDRESS($I17,COLUMN(CCR_1!$J$1)+CP$14-1,,,\"CFR_1\"))) & \"\"","v":""},null,{"$f":"IF(CR$2=\"\",\"\",INDIRECT(ADDRESS($I17,COLUMN(CCR_1!$J$1)+CR$14-1,,,\"CFR_1\"))) & \"\"","v":""},null,{"$f":"IF(CT$2=\"\",\"\",INDIRECT(ADDRESS($I17,COLUMN(CCR_1!$J$1)+CT$14-1,,,\"CFR_1\"))) & \"\"","v":""},null,{"$f":"IF(CV$2=\"\",\"\",INDIRECT(ADDRESS($I17,COLUMN(CCR_1!$J$1)+CV$14-1,,,\"CFR_1\"))) & \"\"","v":""},null,{"$f":"IF(CX$2=\"\",\"\",INDIRECT(ADDRESS($I17,COLUMN(CCR_1!$J$1)+CX$14-1,,,\"CFR_1\"))) & \"\"","v":""},null,{"$f":"IF(CZ$2=\"\",\"\",INDIRECT(ADDRESS($I17,COLUMN(CCR_1!$J$1)+CZ$14-1,,,\"CFR_1\"))) & \"\"","v":""},null,{"$f":"IF(DB$2=\"\",\"\",INDIRECT(ADDRESS($I17,COLUMN(CCR_1!$J$1)+DB$14-1,,,\"CFR_1\"))) & \"\"","v":""},null,{"$f":"IF(DD$2=\"\",\"\",INDIRECT(ADDRESS($I17,COLUMN(CCR_1!$J$1)+DD$14-1,,,\"CFR_1\"))) & \"\"","v":""},null,{"$f":"IF(DF$2=\"\",\"\",INDIRECT(ADDRESS($I17,COLUMN(CCR_1!$J$1)+DF$14-1,,,\"CFR_1\"))) & \"\"","v":""},null,{"$f":"IF(DH$2=\"\",\"\",INDIRECT(ADDRESS($I17,COLUMN(CCR_1!$J$1)+DH$14-1,,,\"CFR_1\"))) & \"\"","v":""},null,{"$f":"IF(DJ$2=\"\",\"\",INDIRECT(ADDRESS($I17,COLUMN(CCR_1!$J$1)+DJ$14-1,,,\"CFR_1\"))) & \"\"","v":""},null,{"$f":"IF(DL$2=\"\",\"\",INDIRECT(ADDRESS($I17,COLUMN(CCR_1!$J$1)+DL$14-1,,,\"CFR_1\"))) & \"\"","v":""},null,{"$f":"IF(DN$2=\"\",\"\",INDIRECT(ADDRESS($I17,COLUMN(CCR_1!$J$1)+DN$14-1,,,\"CFR_1\"))) & \"\"","v":""},null,{"$f":"IF(DP$2=\"\",\"\",INDIRECT(ADDRESS($I17,COLUMN(CCR_1!$J$1)+DP$14-1,,,\"CFR_1\"))) & \"\"","v":""},null,{"$f":"IF(DR$2=\"\",\"\",INDIRECT(ADDRESS($I17,COLUMN(CCR_1!$J$1)+DR$14-1,,,\"CFR_1\"))) & \"\"","v":""},null,{"$f":"IF(DT$2=\"\",\"\",INDIRECT(ADDRESS($I17,COLUMN(CCR_1!$J$1)+DT$14-1,,,\"CFR_1\"))) & \"\"","v":""},null,{"$f":"IF(DV$2=\"\",\"\",INDIRECT(ADDRESS($I17,COLUMN(CCR_1!$J$1)+DV$14-1,,,\"CFR_1\"))) & \"\"","v":""},null,{"$f":"IF(DX$2=\"\",\"\",INDIRECT(ADDRESS($I17,COLUMN(CCR_1!$J$1)+DX$14-1,,,\"CFR_1\"))) & \"\"","v":""},null,{"$f":"IF(DZ$2=\"\",\"\",INDIRECT(ADDRESS($I17,COLUMN(CCR_1!$J$1)+DZ$14-1,,,\"CFR_1\"))) & \"\"","v":""},null,{"$f":"IF(EB$2=\"\",\"\",INDIRECT(ADDRESS($I17,COLUMN(CCR_1!$J$1)+EB$14-1,,,\"CFR_1\"))) & \"\"","v":""},null,{"$f":"IF(ED$2=\"\",\"\",INDIRECT(ADDRESS($I17,COLUMN(CCR_1!$J$1)+ED$14-1,,,\"CFR_1\"))) & \"\"","v":""},null,{"$f":"IF(EF$2=\"\",\"\",INDIRECT(ADDRESS($I17,COLUMN(CCR_1!$J$1)+EF$14-1,,,\"CFR_1\"))) & \"\"","v":""},null,{"$f":"IF(EH$2=\"\",\"\",INDIRECT(ADDRESS($I17,COLUMN(CCR_1!$J$1)+EH$14-1,,,\"CFR_1\"))) & \"\"","v":""},null,{"$f":"IF(EJ$2=\"\",\"\",INDIRECT(ADDRESS($I17,COLUMN(CCR_1!$J$1)+EJ$14-1,,,\"CFR_1\"))) & \"\"","v":""},null,{"$f":"IF(EL$2=\"\",\"\",INDIRECT(ADDRESS($I17,COLUMN(CCR_1!$J$1)+EL$14-1,,,\"CFR_1\"))) & \"\"","v":""},null,{"$f":"IF(EN$2=\"\",\"\",INDIRECT(ADDRESS($I17,COLUMN(CCR_1!$J$1)+EN$14-1,,,\"CFR_1\"))) & \"\"","v":""},null,{"$f":"IF(EP$2=\"\",\"\",INDIRECT(ADDRESS($I17,COLUMN(CCR_1!$J$1)+EP$14-1,,,\"CFR_1\"))) & \"\"","v":""},null,{"$f":"IF(ER$2=\"\",\"\",INDIRECT(ADDRESS($I17,COLUMN(CCR_1!$J$1)+ER$14-1,,,\"CFR_1\"))) & \"\"","v":""},null,{"$f":"IF(ET$2=\"\",\"\",INDIRECT(ADDRESS($I17,COLUMN(CCR_1!$J$1)+ET$14-1,,,\"CFR_1\"))) & \"\"","v":""},null,{"$f":"IF(EV$2=\"\",\"\",INDIRECT(ADDRESS($I17,COLUMN(CCR_1!$J$1)+EV$14-1,,,\"CFR_1\"))) & \"\"","v":""},null,{"$f":"IF(EX$2=\"\",\"\",INDIRECT(ADDRESS($I17,COLUMN(CCR_1!$J$1)+EX$14-1,,,\"CFR_1\"))) & \"\"","v":""},null,{"$f":"IF(EZ$2=\"\",\"\",INDIRECT(ADDRESS($I17,COLUMN(CCR_1!$J$1)+EZ$14-1,,,\"CFR_1\"))) & \"\"","v":""},null,{"$f":"IF(FB$2=\"\",\"\",INDIRECT(ADDRESS($I17,COLUMN(CCR_1!$J$1)+FB$14-1,,,\"CFR_1\"))) & \"\"","v":""},null,{"$f":"IF(FD$2=\"\",\"\",INDIRECT(ADDRESS($I17,COLUMN(CCR_1!$J$1)+FD$14-1,,,\"CFR_1\"))) & \"\"","v":""},null,{"$f":"IF(FF$2=\"\",\"\",INDIRECT(ADDRESS($I17,COLUMN(CCR_1!$J$1)+FF$14-1,,,\"CFR_1\"))) & \"\"","v":""},null,{"$f":"IF(FH$2=\"\",\"\",INDIRECT(ADDRESS($I17,COLUMN(CCR_1!$J$1)+FH$14-1,,,\"CFR_1\"))) & \"\"","v":""},null,{"$f":"IF(FJ$2=\"\",\"\",INDIRECT(ADDRESS($I17,COLUMN(CCR_1!$J$1)+FJ$14-1,,,\"CFR_1\"))) & \"\"","v":""},null,{"$f":"IF(FL$2=\"\",\"\",INDIRECT(ADDRESS($I17,COLUMN(CCR_1!$J$1)+FL$14-1,,,\"CFR_1\"))) & \"\"","v":""}]
[null,"PROGRAM/SITE ADDRESS (Line One)",null,null,null,null,null,null,{"$f":"+ROW(CCR_1!$A$20)","v":20},{"$f":"IF(J$2=\"\",\"\",INDIRECT(ADDRESS($I18,COLUMN(CCR_1!$J$1)+J$14-1,,,\"CCR_1\"))) & \"\"","v":""},null,{"$f":"IF(L$2=\"\",\"\",INDIRECT(ADDRESS($I18,COLUMN(CCR_1!$J$1)+L$14-1,,,\"CCR_1\"))) & \"\"","v":""},null,{"$f":"IF(N$2=\"\",\"\",INDIRECT(ADDRESS($I18,COLUMN(CCR_1!$J$1)+N$14-1,,,\"CCR_1\"))) & \"\"","v":""},null,{"$f":"IF(P$2=\"\",\"\",INDIRECT(ADDRESS($I18,COLUMN(CCR_1!$J$1)+P$14-1,,,\"CCR_1\"))) & \"\"","v":""},null,{"$f":"IF(R$2=\"\",\"\",INDIRECT(ADDRESS($I18,COLUMN(CCR_1!$J$1)+R$14-1,,,\"CCR_1\"))) & \"\"","v":""},null,{"$f":"IF(T$2=\"\",\"\",INDIRECT(ADDRESS($I18,COLUMN(CCR_1!$J$1)+T$14-1,,,\"CCR_1\"))) & \"\"","v":""},null,{"$f":"IF(V$2=\"\",\"\",INDIRECT(ADDRESS($I18,COLUMN(CCR_1!$J$1)+V$14-1,,,\"CCR_1\"))) & \"\"","v":""},null,{"$f":"IF(X$2=\"\",\"\",INDIRECT(ADDRESS($I18,COLUMN(CCR_1!$J$1)+X$14-1,,,\"CCR_1\"))) & \"\"","v":""},null,{"$f":"IF(Z$2=\"\",\"\",INDIRECT(ADDRESS($I18,COLUMN(CCR_1!$J$1)+Z$14-1,,,\"CCR_1\"))) & \"\"","v":""},null,{"$f":"IF(AB$2=\"\",\"\",INDIRECT(ADDRESS($I18,COLUMN(CCR_1!$J$1)+AB$14-1,,,\"CCR_1\"))) & \"\"","v":""},null,{"$f":"IF(AD$2=\"\",\"\",INDIRECT(ADDRESS($I18,COLUMN(CCR_1!$J$1)+AD$14-1,,,\"CCR_1\"))) & \"\"","v":""},null,{"$f":"IF(AF$2=\"\",\"\",INDIRECT(ADDRESS($I18,COLUMN(CCR_1!$J$1)+AF$14-1,,,\"CCR_1\"))) & \"\"","v":""},null,{"$f":"IF(AH$2=\"\",\"\",INDIRECT(ADDRESS($I18,COLUMN(CCR_1!$J$1)+AH$14-1,,,\"CCR_1\"))) & \"\"","v":""},null,{"$f":"IF(AJ$2=\"\",\"\",INDIRECT(ADDRESS($I18,COLUMN(CCR_1!$J$1)+AJ$14-1,,,\"CCR_1\"))) & \"\"","v":""},null,{"$f":"IF(AL$2=\"\",\"\",INDIRECT(ADDRESS($I18,COLUMN(CCR_1!$J$1)+AL$14-1,,,\"CCR_1\"))) & \"\"","v":""},null,{"$f":"IF(AN$2=\"\",\"\",INDIRECT(ADDRESS($I18,COLUMN(CCR_1!$J$1)+AN$14-1,,,\"CCR_1\"))) & \"\"","v":""},null,{"$f":"IF(AP$2=\"\",\"\",INDIRECT(ADDRESS($I18,COLUMN(CCR_1!$J$1)+AP$14-1,,,\"CCR_1\"))) & \"\"","v":""},null,{"$f":"IF(AR$2=\"\",\"\",INDIRECT(ADDRESS($I18,COLUMN(CCR_1!$J$1)+AR$14-1,,,\"CCR_1\"))) & \"\"","v":""},null,{"$f":"IF(AT$2=\"\",\"\",INDIRECT(ADDRESS($I18,COLUMN(CCR_1!$J$1)+AT$14-1,,,\"CCR_1\"))) & \"\"","v":""},null,{"$f":"IF(AV$2=\"\",\"\",INDIRECT(ADDRESS($I18,COLUMN(CCR_1!$J$1)+AV$14-1,,,\"CCR_1\"))) & \"\"","v":""},null,{"$f":"IF(AX$2=\"\",\"\",INDIRECT(ADDRESS($I18,COLUMN(CCR_1!$J$1)+AX$14-1,,,\"CCR_1\"))) & \"\"","v":""},null,{"$f":"IF(AZ$2=\"\",\"\",INDIRECT(ADDRESS($I18,COLUMN(CCR_1!$J$1)+AZ$14-1,,,\"CCR_1\"))) & \"\"","v":""},null,{"$f":"IF(BB$2=\"\",\"\",INDIRECT(ADDRESS($I18,COLUMN(CCR_1!$J$1)+BB$14-1,,,\"CCR_1\"))) & \"\"","v":""},null,{"$f":"IF(BD$2=\"\",\"\",INDIRECT(ADDRESS($I18,COLUMN(CCR_1!$J$1)+BD$14-1,,,\"CCR_1\"))) & \"\"","v":""},null,{"$f":"IF(BF$2=\"\",\"\",INDIRECT(ADDRESS($I18,COLUMN(CCR_1!$J$1)+BF$14-1,,,\"CCR_1\"))) & \"\"","v":""},null,{"$f":"IF(BH$2=\"\",\"\",INDIRECT(ADDRESS($I18,COLUMN(CCR_1!$J$1)+BH$14-1,,,\"CCR_1\"))) & \"\"","v":""},null,{"$f":"IF(BJ$2=\"\",\"\",INDIRECT(ADDRESS($I18,COLUMN(CCR_1!$J$1)+BJ$14-1,,,\"CCR_1\"))) & \"\"","v":""},null,{"$f":"IF(BL$2=\"\",\"\",INDIRECT(ADDRESS($I18,COLUMN(CCR_1!$J$1)+BL$14-1,,,\"CCR_1\"))) & \"\"","v":""},null,{"$f":"IF(BN$2=\"\",\"\",INDIRECT(ADDRESS($I18,COLUMN(CCR_1!$J$1)+BN$14-1,,,\"CCR_1\"))) & \"\"","v":""},null,{"$f":"IF(BP$2=\"\",\"\",INDIRECT(ADDRESS($I18,COLUMN(CCR_1!$J$1)+BP$14-1,,,\"CCR_1\"))) & \"\"","v":""},null,{"$f":"IF(BR$2=\"\",\"\",INDIRECT(ADDRESS($I18,COLUMN(CCR_1!$J$1)+BR$14-1,,,\"CCR_1\"))) & \"\"","v":""},null,{"$f":"IF(BT$2=\"\",\"\",INDIRECT(ADDRESS($I18,COLUMN(CCR_1!$J$1)+BT$14-1,,,\"CCR_1\"))) & \"\"","v":""},null,{"$f":"IF(BV$2=\"\",\"\",INDIRECT(ADDRESS($I18,COLUMN(CCR_1!$J$1)+BV$14-1,,,\"CCR_1\"))) & \"\"","v":""},null,{"$f":"IF(BX$2=\"\",\"\",INDIRECT(ADDRESS($I18,COLUMN(CCR_1!$J$1)+BX$14-1,,,\"CCR_1\"))) & \"\"","v":""},null,{"$f":"IF(BZ$2=\"\",\"\",INDIRECT(ADDRESS($I18,COLUMN(CCR_1!$J$1)+BZ$14-1,,,\"CCR_1\"))) & \"\"","v":""},null,{"$f":"IF(CB$2=\"\",\"\",INDIRECT(ADDRESS($I18,COLUMN(CCR_1!$J$1)+CB$14-1,,,\"CCR_1\"))) & \"\"","v":""},null,{"$f":"IF(CD$2=\"\",\"\",INDIRECT(ADDRESS($I18,COLUMN(CCR_1!$J$1)+CD$14-1,,,\"CCR_1\"))) & \"\"","v":""},null,{"$f":"IF(CF$2=\"\",\"\",INDIRECT(ADDRESS($I18,COLUMN(CCR_1!$J$1)+CF$14-1,,,\"CCR_1\"))) & \"\"","v":""},null,{"$f":"IF(CH$2=\"\",\"\",INDIRECT(ADDRESS($I18,COLUMN(CCR_1!$J$1)+CH$14-1,,,\"CCR_1\"))) & \"\"","v":""},null,{"$f":"IF(CJ$2=\"\",\"\",INDIRECT(ADDRESS($I18,COLUMN(CCR_1!$J$1)+CJ$14-1,,,\"CFR_1\"))) & \"\"","v":""},null,{"$f":"IF(CL$2=\"\",\"\",INDIRECT(ADDRESS($I18,COLUMN(CCR_1!$J$1)+CL$14-1,,,\"CFR_1\"))) & \"\"","v":""},null,{"$f":"IF(CN$2=\"\",\"\",INDIRECT(ADDRESS($I18,COLUMN(CCR_1!$J$1)+CN$14-1,,,\"CFR_1\"))) & \"\"","v":""},null,{"$f":"IF(CP$2=\"\",\"\",INDIRECT(ADDRESS($I18,COLUMN(CCR_1!$J$1)+CP$14-1,,,\"CFR_1\"))) & \"\"","v":""},null,{"$f":"IF(CR$2=\"\",\"\",INDIRECT(ADDRESS($I18,COLUMN(CCR_1!$J$1)+CR$14-1,,,\"CFR_1\"))) & \"\"","v":""},null,{"$f":"IF(CT$2=\"\",\"\",INDIRECT(ADDRESS($I18,COLUMN(CCR_1!$J$1)+CT$14-1,,,\"CFR_1\"))) & \"\"","v":""},null,{"$f":"IF(CV$2=\"\",\"\",INDIRECT(ADDRESS($I18,COLUMN(CCR_1!$J$1)+CV$14-1,,,\"CFR_1\"))) & \"\"","v":""},null,{"$f":"IF(CX$2=\"\",\"\",INDIRECT(ADDRESS($I18,COLUMN(CCR_1!$J$1)+CX$14-1,,,\"CFR_1\"))) & \"\"","v":""},null,{"$f":"IF(CZ$2=\"\",\"\",INDIRECT(ADDRESS($I18,COLUMN(CCR_1!$J$1)+CZ$14-1,,,\"CFR_1\"))) & \"\"","v":""},null,{"$f":"IF(DB$2=\"\",\"\",INDIRECT(ADDRESS($I18,COLUMN(CCR_1!$J$1)+DB$14-1,,,\"CFR_1\"))) & \"\"","v":""},null,{"$f":"IF(DD$2=\"\",\"\",INDIRECT(ADDRESS($I18,COLUMN(CCR_1!$J$1)+DD$14-1,,,\"CFR_1\"))) & \"\"","v":""},null,{"$f":"IF(DF$2=\"\",\"\",INDIRECT(ADDRESS($I18,COLUMN(CCR_1!$J$1)+DF$14-1,,,\"CFR_1\"))) & \"\"","v":""},null,{"$f":"IF(DH$2=\"\",\"\",INDIRECT(ADDRESS($I18,COLUMN(CCR_1!$J$1)+DH$14-1,,,\"CFR_1\"))) & \"\"","v":""},null,{"$f":"IF(DJ$2=\"\",\"\",INDIRECT(ADDRESS($I18,COLUMN(CCR_1!$J$1)+DJ$14-1,,,\"CFR_1\"))) & \"\"","v":""},null,{"$f":"IF(DL$2=\"\",\"\",INDIRECT(ADDRESS($I18,COLUMN(CCR_1!$J$1)+DL$14-1,,,\"CFR_1\"))) & \"\"","v":""},null,{"$f":"IF(DN$2=\"\",\"\",INDIRECT(ADDRESS($I18,COLUMN(CCR_1!$J$1)+DN$14-1,,,\"CFR_1\"))) & \"\"","v":""},null,{"$f":"IF(DP$2=\"\",\"\",INDIRECT(ADDRESS($I18,COLUMN(CCR_1!$J$1)+DP$14-1,,,\"CFR_1\"))) & \"\"","v":""},null,{"$f":"IF(DR$2=\"\",\"\",INDIRECT(ADDRESS($I18,COLUMN(CCR_1!$J$1)+DR$14-1,,,\"CFR_1\"))) & \"\"","v":""},null,{"$f":"IF(DT$2=\"\",\"\",INDIRECT(ADDRESS($I18,COLUMN(CCR_1!$J$1)+DT$14-1,,,\"CFR_1\"))) & \"\"","v":""},null,{"$f":"IF(DV$2=\"\",\"\",INDIRECT(ADDRESS($I18,COLUMN(CCR_1!$J$1)+DV$14-1,,,\"CFR_1\"))) & \"\"","v":""},null,{"$f":"IF(DX$2=\"\",\"\",INDIRECT(ADDRESS($I18,COLUMN(CCR_1!$J$1)+DX$14-1,,,\"CFR_1\"))) & \"\"","v":""},null,{"$f":"IF(DZ$2=\"\",\"\",INDIRECT(ADDRESS($I18,COLUMN(CCR_1!$J$1)+DZ$14-1,,,\"CFR_1\"))) & \"\"","v":""},null,{"$f":"IF(EB$2=\"\",\"\",INDIRECT(ADDRESS($I18,COLUMN(CCR_1!$J$1)+EB$14-1,,,\"CFR_1\"))) & \"\"","v":""},null,{"$f":"IF(ED$2=\"\",\"\",INDIRECT(ADDRESS($I18,COLUMN(CCR_1!$J$1)+ED$14-1,,,\"CFR_1\"))) & \"\"","v":""},null,{"$f":"IF(EF$2=\"\",\"\",INDIRECT(ADDRESS($I18,COLUMN(CCR_1!$J$1)+EF$14-1,,,\"CFR_1\"))) & \"\"","v":""},null,{"$f":"IF(EH$2=\"\",\"\",INDIRECT(ADDRESS($I18,COLUMN(CCR_1!$J$1)+EH$14-1,,,\"CFR_1\"))) & \"\"","v":""},null,{"$f":"IF(EJ$2=\"\",\"\",INDIRECT(ADDRESS($I18,COLUMN(CCR_1!$J$1)+EJ$14-1,,,\"CFR_1\"))) & \"\"","v":""},null,{"$f":"IF(EL$2=\"\",\"\",INDIRECT(ADDRESS($I18,COLUMN(CCR_1!$J$1)+EL$14-1,,,\"CFR_1\"))) & \"\"","v":""},null,{"$f":"IF(EN$2=\"\",\"\",INDIRECT(ADDRESS($I18,COLUMN(CCR_1!$J$1)+EN$14-1,,,\"CFR_1\"))) & \"\"","v":""},null,{"$f":"IF(EP$2=\"\",\"\",INDIRECT(ADDRESS($I18,COLUMN(CCR_1!$J$1)+EP$14-1,,,\"CFR_1\"))) & \"\"","v":""},null,{"$f":"IF(ER$2=\"\",\"\",INDIRECT(ADDRESS($I18,COLUMN(CCR_1!$J$1)+ER$14-1,,,\"CFR_1\"))) & \"\"","v":""},null,{"$f":"IF(ET$2=\"\",\"\",INDIRECT(ADDRESS($I18,COLUMN(CCR_1!$J$1)+ET$14-1,,,\"CFR_1\"))) & \"\"","v":""},null,{"$f":"IF(EV$2=\"\",\"\",INDIRECT(ADDRESS($I18,COLUMN(CCR_1!$J$1)+EV$14-1,,,\"CFR_1\"))) & \"\"","v":""},null,{"$f":"IF(EX$2=\"\",\"\",INDIRECT(ADDRESS($I18,COLUMN(CCR_1!$J$1)+EX$14-1,,,\"CFR_1\"))) & \"\"","v":""},null,{"$f":"IF(EZ$2=\"\",\"\",INDIRECT(ADDRESS($I18,COLUMN(CCR_1!$J$1)+EZ$14-1,,,\"CFR_1\"))) & \"\"","v":""},null,{"$f":"IF(FB$2=\"\",\"\",INDIRECT(ADDRESS($I18,COLUMN(CCR_1!$J$1)+FB$14-1,,,\"CFR_1\"))) & \"\"","v":""},null,{"$f":"IF(FD$2=\"\",\"\",INDIRECT(ADDRESS($I18,COLUMN(CCR_1!$J$1)+FD$14-1,,,\"CFR_1\"))) & \"\"","v":""},null,{"$f":"IF(FF$2=\"\",\"\",INDIRECT(ADDRESS($I18,COLUMN(CCR_1!$J$1)+FF$14-1,,,\"CFR_1\"))) & \"\"","v":""},null,{"$f":"IF(FH$2=\"\",\"\",INDIRECT(ADDRESS($I18,COLUMN(CCR_1!$J$1)+FH$14-1,,,\"CFR_1\"))) & \"\"","v":""},null,{"$f":"IF(FJ$2=\"\",\"\",INDIRECT(ADDRESS($I18,COLUMN(CCR_1!$J$1)+FJ$14-1,,,\"CFR_1\"))) & \"\"","v":""},null,{"$f":"IF(FL$2=\"\",\"\",INDIRECT(ADDRESS($I18,COLUMN(CCR_1!$J$1)+FL$14-1,,,\"CFR_1\"))) & \"\"","v":""}]
[null,"PROGRAM/SITE ADDRESS (Line Two)",null,null,null,null,null,null,{"$f":"ROW(CCR_1!$A$21)","v":21},{"$f":"IF(J$2=\"\",\"\",INDIRECT(ADDRESS($I19,COLUMN(CCR_1!$J$1)+J$14-1,,,\"CCR_1\"))) & \"\"","v":""},null,{"$f":"IF(L$2=\"\",\"\",INDIRECT(ADDRESS($I19,COLUMN(CCR_1!$J$1)+L$14-1,,,\"CCR_1\"))) & \"\"","v":""},null,{"$f":"IF(N$2=\"\",\"\",INDIRECT(ADDRESS($I19,COLUMN(CCR_1!$J$1)+N$14-1,,,\"CCR_1\"))) & \"\"","v":""},null,{"$f":"IF(P$2=\"\",\"\",INDIRECT(ADDRESS($I19,COLUMN(CCR_1!$J$1)+P$14-1,,,\"CCR_1\"))) & \"\"","v":""},null,{"$f":"IF(R$2=\"\",\"\",INDIRECT(ADDRESS($I19,COLUMN(CCR_1!$J$1)+R$14-1,,,\"CCR_1\"))) & \"\"","v":""},null,{"$f":"IF(T$2=\"\",\"\",INDIRECT(ADDRESS($I19,COLUMN(CCR_1!$J$1)+T$14-1,,,\"CCR_1\"))) & \"\"","v":""},null,{"$f":"IF(V$2=\"\",\"\",INDIRECT(ADDRESS($I19,COLUMN(CCR_1!$J$1)+V$14-1,,,\"CCR_1\"))) & \"\"","v":""},null,{"$f":"IF(X$2=\"\",\"\",INDIRECT(ADDRESS($I19,COLUMN(CCR_1!$J$1)+X$14-1,,,\"CCR_1\"))) & \"\"","v":""},null,{"$f":"IF(Z$2=\"\",\"\",INDIRECT(ADDRESS($I19,COLUMN(CCR_1!$J$1)+Z$14-1,,,\"CCR_1\"))) & \"\"","v":""},null,{"$f":"IF(AB$2=\"\",\"\",INDIRECT(ADDRESS($I19,COLUMN(CCR_1!$J$1)+AB$14-1,,,\"CCR_1\"))) & \"\"","v":""},null,{"$f":"IF(AD$2=\"\",\"\",INDIRECT(ADDRESS($I19,COLUMN(CCR_1!$J$1)+AD$14-1,,,\"CCR_1\"))) & \"\"","v":""},null,{"$f":"IF(AF$2=\"\",\"\",INDIRECT(ADDRESS($I19,COLUMN(CCR_1!$J$1)+AF$14-1,,,\"CCR_1\"))) & \"\"","v":""},null,{"$f":"IF(AH$2=\"\",\"\",INDIRECT(ADDRESS($I19,COLUMN(CCR_1!$J$1)+AH$14-1,,,\"CCR_1\"))) & \"\"","v":""},null,{"$f":"IF(AJ$2=\"\",\"\",INDIRECT(ADDRESS($I19,COLUMN(CCR_1!$J$1)+AJ$14-1,,,\"CCR_1\"))) & \"\"","v":""},null,{"$f":"IF(AL$2=\"\",\"\",INDIRECT(ADDRESS($I19,COLUMN(CCR_1!$J$1)+AL$14-1,,,\"CCR_1\"))) & \"\"","v":""},null,{"$f":"IF(AN$2=\"\",\"\",INDIRECT(ADDRESS($I19,COLUMN(CCR_1!$J$1)+AN$14-1,,,\"CCR_1\"))) & \"\"","v":""},null,{"$f":"IF(AP$2=\"\",\"\",INDIRECT(ADDRESS($I19,COLUMN(CCR_1!$J$1)+AP$14-1,,,\"CCR_1\"))) & \"\"","v":""},null,{"$f":"IF(AR$2=\"\",\"\",INDIRECT(ADDRESS($I19,COLUMN(CCR_1!$J$1)+AR$14-1,,,\"CCR_1\"))) & \"\"","v":""},null,{"$f":"IF(AT$2=\"\",\"\",INDIRECT(ADDRESS($I19,COLUMN(CCR_1!$J$1)+AT$14-1,,,\"CCR_1\"))) & \"\"","v":""},null,{"$f":"IF(AV$2=\"\",\"\",INDIRECT(ADDRESS($I19,COLUMN(CCR_1!$J$1)+AV$14-1,,,\"CCR_1\"))) & \"\"","v":""},null,{"$f":"IF(AX$2=\"\",\"\",INDIRECT(ADDRESS($I19,COLUMN(CCR_1!$J$1)+AX$14-1,,,\"CCR_1\"))) & \"\"","v":""},null,{"$f":"IF(AZ$2=\"\",\"\",INDIRECT(ADDRESS($I19,COLUMN(CCR_1!$J$1)+AZ$14-1,,,\"CCR_1\"))) & \"\"","v":""},null,{"$f":"IF(BB$2=\"\",\"\",INDIRECT(ADDRESS($I19,COLUMN(CCR_1!$J$1)+BB$14-1,,,\"CCR_1\"))) & \"\"","v":""},null,{"$f":"IF(BD$2=\"\",\"\",INDIRECT(ADDRESS($I19,COLUMN(CCR_1!$J$1)+BD$14-1,,,\"CCR_1\"))) & \"\"","v":""},null,{"$f":"IF(BF$2=\"\",\"\",INDIRECT(ADDRESS($I19,COLUMN(CCR_1!$J$1)+BF$14-1,,,\"CCR_1\"))) & \"\"","v":""},null,{"$f":"IF(BH$2=\"\",\"\",INDIRECT(ADDRESS($I19,COLUMN(CCR_1!$J$1)+BH$14-1,,,\"CCR_1\"))) & \"\"","v":""},null,{"$f":"IF(BJ$2=\"\",\"\",INDIRECT(ADDRESS($I19,COLUMN(CCR_1!$J$1)+BJ$14-1,,,\"CCR_1\"))) & \"\"","v":""},null,{"$f":"IF(BL$2=\"\",\"\",INDIRECT(ADDRESS($I19,COLUMN(CCR_1!$J$1)+BL$14-1,,,\"CCR_1\"))) & \"\"","v":""},null,{"$f":"IF(BN$2=\"\",\"\",INDIRECT(ADDRESS($I19,COLUMN(CCR_1!$J$1)+BN$14-1,,,\"CCR_1\"))) & \"\"","v":""},null,{"$f":"IF(BP$2=\"\",\"\",INDIRECT(ADDRESS($I19,COLUMN(CCR_1!$J$1)+BP$14-1,,,\"CCR_1\"))) & \"\"","v":""},null,{"$f":"IF(BR$2=\"\",\"\",INDIRECT(ADDRESS($I19,COLUMN(CCR_1!$J$1)+BR$14-1,,,\"CCR_1\"))) & \"\"","v":""},null,{"$f":"IF(BT$2=\"\",\"\",INDIRECT(ADDRESS($I19,COLUMN(CCR_1!$J$1)+BT$14-1,,,\"CCR_1\"))) & \"\"","v":""},null,{"$f":"IF(BV$2=\"\",\"\",INDIRECT(ADDRESS($I19,COLUMN(CCR_1!$J$1)+BV$14-1,,,\"CCR_1\"))) & \"\"","v":""},null,{"$f":"IF(BX$2=\"\",\"\",INDIRECT(ADDRESS($I19,COLUMN(CCR_1!$J$1)+BX$14-1,,,\"CCR_1\"))) & \"\"","v":""},null,{"$f":"IF(BZ$2=\"\",\"\",INDIRECT(ADDRESS($I19,COLUMN(CCR_1!$J$1)+BZ$14-1,,,\"CCR_1\"))) & \"\"","v":""},null,{"$f":"IF(CB$2=\"\",\"\",INDIRECT(ADDRESS($I19,COLUMN(CCR_1!$J$1)+CB$14-1,,,\"CCR_1\"))) & \"\"","v":""},null,{"$f":"IF(CD$2=\"\",\"\",INDIRECT(ADDRESS($I19,COLUMN(CCR_1!$J$1)+CD$14-1,,,\"CCR_1\"))) & \"\"","v":""},null,{"$f":"IF(CF$2=\"\",\"\",INDIRECT(ADDRESS($I19,COLUMN(CCR_1!$J$1)+CF$14-1,,,\"CCR_1\"))) & \"\"","v":""},null,{"$f":"IF(CH$2=\"\",\"\",INDIRECT(ADDRESS($I19,COLUMN(CCR_1!$J$1)+CH$14-1,,,\"CCR_1\"))) & \"\"","v":""},null,{"$f":"IF(CJ$2=\"\",\"\",INDIRECT(ADDRESS($I19,COLUMN(CCR_1!$J$1)+CJ$14-1,,,\"CFR_1\"))) & \"\"","v":""},null,{"$f":"IF(CL$2=\"\",\"\",INDIRECT(ADDRESS($I19,COLUMN(CCR_1!$J$1)+CL$14-1,,,\"CFR_1\"))) & \"\"","v":""},null,{"$f":"IF(CN$2=\"\",\"\",INDIRECT(ADDRESS($I19,COLUMN(CCR_1!$J$1)+CN$14-1,,,\"CFR_1\"))) & \"\"","v":""},null,{"$f":"IF(CP$2=\"\",\"\",INDIRECT(ADDRESS($I19,COLUMN(CCR_1!$J$1)+CP$14-1,,,\"CFR_1\"))) & \"\"","v":""},null,{"$f":"IF(CR$2=\"\",\"\",INDIRECT(ADDRESS($I19,COLUMN(CCR_1!$J$1)+CR$14-1,,,\"CFR_1\"))) & \"\"","v":""},null,{"$f":"IF(CT$2=\"\",\"\",INDIRECT(ADDRESS($I19,COLUMN(CCR_1!$J$1)+CT$14-1,,,\"CFR_1\"))) & \"\"","v":""},null,{"$f":"IF(CV$2=\"\",\"\",INDIRECT(ADDRESS($I19,COLUMN(CCR_1!$J$1)+CV$14-1,,,\"CFR_1\"))) & \"\"","v":""},null,{"$f":"IF(CX$2=\"\",\"\",INDIRECT(ADDRESS($I19,COLUMN(CCR_1!$J$1)+CX$14-1,,,\"CFR_1\"))) & \"\"","v":""},null,{"$f":"IF(CZ$2=\"\",\"\",INDIRECT(ADDRESS($I19,COLUMN(CCR_1!$J$1)+CZ$14-1,,,\"CFR_1\"))) & \"\"","v":""},null,{"$f":"IF(DB$2=\"\",\"\",INDIRECT(ADDRESS($I19,COLUMN(CCR_1!$J$1)+DB$14-1,,,\"CFR_1\"))) & \"\"","v":""},null,{"$f":"IF(DD$2=\"\",\"\",INDIRECT(ADDRESS($I19,COLUMN(CCR_1!$J$1)+DD$14-1,,,\"CFR_1\"))) & \"\"","v":""},null,{"$f":"IF(DF$2=\"\",\"\",INDIRECT(ADDRESS($I19,COLUMN(CCR_1!$J$1)+DF$14-1,,,\"CFR_1\"))) & \"\"","v":""},null,{"$f":"IF(DH$2=\"\",\"\",INDIRECT(ADDRESS($I19,COLUMN(CCR_1!$J$1)+DH$14-1,,,\"CFR_1\"))) & \"\"","v":""},null,{"$f":"IF(DJ$2=\"\",\"\",INDIRECT(ADDRESS($I19,COLUMN(CCR_1!$J$1)+DJ$14-1,,,\"CFR_1\"))) & \"\"","v":""},null,{"$f":"IF(DL$2=\"\",\"\",INDIRECT(ADDRESS($I19,COLUMN(CCR_1!$J$1)+DL$14-1,,,\"CFR_1\"))) & \"\"","v":""},null,{"$f":"IF(DN$2=\"\",\"\",INDIRECT(ADDRESS($I19,COLUMN(CCR_1!$J$1)+DN$14-1,,,\"CFR_1\"))) & \"\"","v":""},null,{"$f":"IF(DP$2=\"\",\"\",INDIRECT(ADDRESS($I19,COLUMN(CCR_1!$J$1)+DP$14-1,,,\"CFR_1\"))) & \"\"","v":""},null,{"$f":"IF(DR$2=\"\",\"\",INDIRECT(ADDRESS($I19,COLUMN(CCR_1!$J$1)+DR$14-1,,,\"CFR_1\"))) & \"\"","v":""},null,{"$f":"IF(DT$2=\"\",\"\",INDIRECT(ADDRESS($I19,COLUMN(CCR_1!$J$1)+DT$14-1,,,\"CFR_1\"))) & \"\"","v":""},null,{"$f":"IF(DV$2=\"\",\"\",INDIRECT(ADDRESS($I19,COLUMN(CCR_1!$J$1)+DV$14-1,,,\"CFR_1\"))) & \"\"","v":""},null,{"$f":"IF(DX$2=\"\",\"\",INDIRECT(ADDRESS($I19,COLUMN(CCR_1!$J$1)+DX$14-1,,,\"CFR_1\"))) & \"\"","v":""},null,{"$f":"IF(DZ$2=\"\",\"\",INDIRECT(ADDRESS($I19,COLUMN(CCR_1!$J$1)+DZ$14-1,,,\"CFR_1\"))) & \"\"","v":""},null,{"$f":"IF(EB$2=\"\",\"\",INDIRECT(ADDRESS($I19,COLUMN(CCR_1!$J$1)+EB$14-1,,,\"CFR_1\"))) & \"\"","v":""},null,{"$f":"IF(ED$2=\"\",\"\",INDIRECT(ADDRESS($I19,COLUMN(CCR_1!$J$1)+ED$14-1,,,\"CFR_1\"))) & \"\"","v":""},null,{"$f":"IF(EF$2=\"\",\"\",INDIRECT(ADDRESS($I19,COLUMN(CCR_1!$J$1)+EF$14-1,,,\"CFR_1\"))) & \"\"","v":""},null,{"$f":"IF(EH$2=\"\",\"\",INDIRECT(ADDRESS($I19,COLUMN(CCR_1!$J$1)+EH$14-1,,,\"CFR_1\"))) & \"\"","v":""},null,{"$f":"IF(EJ$2=\"\",\"\",INDIRECT(ADDRESS($I19,COLUMN(CCR_1!$J$1)+EJ$14-1,,,\"CFR_1\"))) & \"\"","v":""},null,{"$f":"IF(EL$2=\"\",\"\",INDIRECT(ADDRESS($I19,COLUMN(CCR_1!$J$1)+EL$14-1,,,\"CFR_1\"))) & \"\"","v":""},null,{"$f":"IF(EN$2=\"\",\"\",INDIRECT(ADDRESS($I19,COLUMN(CCR_1!$J$1)+EN$14-1,,,\"CFR_1\"))) & \"\"","v":""},null,{"$f":"IF(EP$2=\"\",\"\",INDIRECT(ADDRESS($I19,COLUMN(CCR_1!$J$1)+EP$14-1,,,\"CFR_1\"))) & \"\"","v":""},null,{"$f":"IF(ER$2=\"\",\"\",INDIRECT(ADDRESS($I19,COLUMN(CCR_1!$J$1)+ER$14-1,,,\"CFR_1\"))) & \"\"","v":""},null,{"$f":"IF(ET$2=\"\",\"\",INDIRECT(ADDRESS($I19,COLUMN(CCR_1!$J$1)+ET$14-1,,,\"CFR_1\"))) & \"\"","v":""},null,{"$f":"IF(EV$2=\"\",\"\",INDIRECT(ADDRESS($I19,COLUMN(CCR_1!$J$1)+EV$14-1,,,\"CFR_1\"))) & \"\"","v":""},null,{"$f":"IF(EX$2=\"\",\"\",INDIRECT(ADDRESS($I19,COLUMN(CCR_1!$J$1)+EX$14-1,,,\"CFR_1\"))) & \"\"","v":""},null,{"$f":"IF(EZ$2=\"\",\"\",INDIRECT(ADDRESS($I19,COLUMN(CCR_1!$J$1)+EZ$14-1,,,\"CFR_1\"))) & \"\"","v":""},null,{"$f":"IF(FB$2=\"\",\"\",INDIRECT(ADDRESS($I19,COLUMN(CCR_1!$J$1)+FB$14-1,,,\"CFR_1\"))) & \"\"","v":""},null,{"$f":"IF(FD$2=\"\",\"\",INDIRECT(ADDRESS($I19,COLUMN(CCR_1!$J$1)+FD$14-1,,,\"CFR_1\"))) & \"\"","v":""},null,{"$f":"IF(FF$2=\"\",\"\",INDIRECT(ADDRESS($I19,COLUMN(CCR_1!$J$1)+FF$14-1,,,\"CFR_1\"))) & \"\"","v":""},null,{"$f":"IF(FH$2=\"\",\"\",INDIRECT(ADDRESS($I19,COLUMN(CCR_1!$J$1)+FH$14-1,,,\"CFR_1\"))) & \"\"","v":""},null,{"$f":"IF(FJ$2=\"\",\"\",INDIRECT(ADDRESS($I19,COLUMN(CCR_1!$J$1)+FJ$14-1,,,\"CFR_1\"))) & \"\"","v":""},null,{"$f":"IF(FL$2=\"\",\"\",INDIRECT(ADDRESS($I19,COLUMN(CCR_1!$J$1)+FL$14-1,,,\"CFR_1\"))) & \"\"","v":""}]
[null,"COUNTY CODE",null,null,null,null,null,null,{"$f":"ROW(CCR_1!$A$22)","v":22},{"$f":"IF(J$2=\"\",\"\",INDIRECT(ADDRESS($I20,COLUMN(CCR_1!$J$1)+J$14-1,,,\"CCR_1\"))) & \"\"","v":""},null,{"$f":"IF(L$2=\"\",\"\",INDIRECT(ADDRESS($I20,COLUMN(CCR_1!$J$1)+L$14-1,,,\"CCR_1\"))) & \"\"","v":""},null,{"$f":"IF(N$2=\"\",\"\",INDIRECT(ADDRESS($I20,COLUMN(CCR_1!$J$1)+N$14-1,,,\"CCR_1\"))) & \"\"","v":""},null,{"$f":"IF(P$2=\"\",\"\",INDIRECT(ADDRESS($I20,COLUMN(CCR_1!$J$1)+P$14-1,,,\"CCR_1\"))) & \"\"","v":""},null,{"$f":"IF(R$2=\"\",\"\",INDIRECT(ADDRESS($I20,COLUMN(CCR_1!$J$1)+R$14-1,,,\"CCR_1\"))) & \"\"","v":""},null,{"$f":"IF(T$2=\"\",\"\",INDIRECT(ADDRESS($I20,COLUMN(CCR_1!$J$1)+T$14-1,,,\"CCR_1\"))) & \"\"","v":""},null,{"$f":"IF(V$2=\"\",\"\",INDIRECT(ADDRESS($I20,COLUMN(CCR_1!$J$1)+V$14-1,,,\"CCR_1\"))) & \"\"","v":""},null,{"$f":"IF(X$2=\"\",\"\",INDIRECT(ADDRESS($I20,COLUMN(CCR_1!$J$1)+X$14-1,,,\"CCR_1\"))) & \"\"","v":""},null,{"$f":"IF(Z$2=\"\",\"\",INDIRECT(ADDRESS($I20,COLUMN(CCR_1!$J$1)+Z$14-1,,,\"CCR_1\"))) & \"\"","v":""},null,{"$f":"IF(AB$2=\"\",\"\",INDIRECT(ADDRESS($I20,COLUMN(CCR_1!$J$1)+AB$14-1,,,\"CCR_1\"))) & \"\"","v":""},null,{"$f":"IF(AD$2=\"\",\"\",INDIRECT(ADDRESS($I20,COLUMN(CCR_1!$J$1)+AD$14-1,,,\"CCR_1\"))) & \"\"","v":""},null,{"$f":"IF(AF$2=\"\",\"\",INDIRECT(ADDRESS($I20,COLUMN(CCR_1!$J$1)+AF$14-1,,,\"CCR_1\"))) & \"\"","v":""},null,{"$f":"IF(AH$2=\"\",\"\",INDIRECT(ADDRESS($I20,COLUMN(CCR_1!$J$1)+AH$14-1,,,\"CCR_1\"))) & \"\"","v":""},null,{"$f":"IF(AJ$2=\"\",\"\",INDIRECT(ADDRESS($I20,COLUMN(CCR_1!$J$1)+AJ$14-1,,,\"CCR_1\"))) & \"\"","v":""},null,{"$f":"IF(AL$2=\"\",\"\",INDIRECT(ADDRESS($I20,COLUMN(CCR_1!$J$1)+AL$14-1,,,\"CCR_1\"))) & \"\"","v":""},null,{"$f":"IF(AN$2=\"\",\"\",INDIRECT(ADDRESS($I20,COLUMN(CCR_1!$J$1)+AN$14-1,,,\"CCR_1\"))) & \"\"","v":""},null,{"$f":"IF(AP$2=\"\",\"\",INDIRECT(ADDRESS($I20,COLUMN(CCR_1!$J$1)+AP$14-1,,,\"CCR_1\"))) & \"\"","v":""},null,{"$f":"IF(AR$2=\"\",\"\",INDIRECT(ADDRESS($I20,COLUMN(CCR_1!$J$1)+AR$14-1,,,\"CCR_1\"))) & \"\"","v":""},null,{"$f":"IF(AT$2=\"\",\"\",INDIRECT(ADDRESS($I20,COLUMN(CCR_1!$J$1)+AT$14-1,,,\"CCR_1\"))) & \"\"","v":""},null,{"$f":"IF(AV$2=\"\",\"\",INDIRECT(ADDRESS($I20,COLUMN(CCR_1!$J$1)+AV$14-1,,,\"CCR_1\"))) & \"\"","v":""},null,{"$f":"IF(AX$2=\"\",\"\",INDIRECT(ADDRESS($I20,COLUMN(CCR_1!$J$1)+AX$14-1,,,\"CCR_1\"))) & \"\"","v":""},null,{"$f":"IF(AZ$2=\"\",\"\",INDIRECT(ADDRESS($I20,COLUMN(CCR_1!$J$1)+AZ$14-1,,,\"CCR_1\"))) & \"\"","v":""},null,{"$f":"IF(BB$2=\"\",\"\",INDIRECT(ADDRESS($I20,COLUMN(CCR_1!$J$1)+BB$14-1,,,\"CCR_1\"))) & \"\"","v":""},null,{"$f":"IF(BD$2=\"\",\"\",INDIRECT(ADDRESS($I20,COLUMN(CCR_1!$J$1)+BD$14-1,,,\"CCR_1\"))) & \"\"","v":""},null,{"$f":"IF(BF$2=\"\",\"\",INDIRECT(ADDRESS($I20,COLUMN(CCR_1!$J$1)+BF$14-1,,,\"CCR_1\"))) & \"\"","v":""},null,{"$f":"IF(BH$2=\"\",\"\",INDIRECT(ADDRESS($I20,COLUMN(CCR_1!$J$1)+BH$14-1,,,\"CCR_1\"))) & \"\"","v":""},null,{"$f":"IF(BJ$2=\"\",\"\",INDIRECT(ADDRESS($I20,COLUMN(CCR_1!$J$1)+BJ$14-1,,,\"CCR_1\"))) & \"\"","v":""},null,{"$f":"IF(BL$2=\"\",\"\",INDIRECT(ADDRESS($I20,COLUMN(CCR_1!$J$1)+BL$14-1,,,\"CCR_1\"))) & \"\"","v":""},null,{"$f":"IF(BN$2=\"\",\"\",INDIRECT(ADDRESS($I20,COLUMN(CCR_1!$J$1)+BN$14-1,,,\"CCR_1\"))) & \"\"","v":""},null,{"$f":"IF(BP$2=\"\",\"\",INDIRECT(ADDRESS($I20,COLUMN(CCR_1!$J$1)+BP$14-1,,,\"CCR_1\"))) & \"\"","v":""},null,{"$f":"IF(BR$2=\"\",\"\",INDIRECT(ADDRESS($I20,COLUMN(CCR_1!$J$1)+BR$14-1,,,\"CCR_1\"))) & \"\"","v":""},null,{"$f":"IF(BT$2=\"\",\"\",INDIRECT(ADDRESS($I20,COLUMN(CCR_1!$J$1)+BT$14-1,,,\"CCR_1\"))) & \"\"","v":""},null,{"$f":"IF(BV$2=\"\",\"\",INDIRECT(ADDRESS($I20,COLUMN(CCR_1!$J$1)+BV$14-1,,,\"CCR_1\"))) & \"\"","v":""},null,{"$f":"IF(BX$2=\"\",\"\",INDIRECT(ADDRESS($I20,COLUMN(CCR_1!$J$1)+BX$14-1,,,\"CCR_1\"))) & \"\"","v":""},null,{"$f":"IF(BZ$2=\"\",\"\",INDIRECT(ADDRESS($I20,COLUMN(CCR_1!$J$1)+BZ$14-1,,,\"CCR_1\"))) & \"\"","v":""},null,{"$f":"IF(CB$2=\"\",\"\",INDIRECT(ADDRESS($I20,COLUMN(CCR_1!$J$1)+CB$14-1,,,\"CCR_1\"))) & \"\"","v":""},null,{"$f":"IF(CD$2=\"\",\"\",INDIRECT(ADDRESS($I20,COLUMN(CCR_1!$J$1)+CD$14-1,,,\"CCR_1\"))) & \"\"","v":""},null,{"$f":"IF(CF$2=\"\",\"\",INDIRECT(ADDRESS($I20,COLUMN(CCR_1!$J$1)+CF$14-1,,,\"CCR_1\"))) & \"\"","v":""},null,{"$f":"IF(CH$2=\"\",\"\",INDIRECT(ADDRESS($I20,COLUMN(CCR_1!$J$1)+CH$14-1,,,\"CCR_1\"))) & \"\"","v":""},null,{"$f":"IF(CJ$2=\"\",\"\",INDIRECT(ADDRESS($I20,COLUMN(CCR_1!$J$1)+CJ$14-1,,,\"CFR_1\"))) & \"\"","v":""},null,{"$f":"IF(CL$2=\"\",\"\",INDIRECT(ADDRESS($I20,COLUMN(CCR_1!$J$1)+CL$14-1,,,\"CFR_1\"))) & \"\"","v":""},null,{"$f":"IF(CN$2=\"\",\"\",INDIRECT(ADDRESS($I20,COLUMN(CCR_1!$J$1)+CN$14-1,,,\"CFR_1\"))) & \"\"","v":""},null,{"$f":"IF(CP$2=\"\",\"\",INDIRECT(ADDRESS($I20,COLUMN(CCR_1!$J$1)+CP$14-1,,,\"CFR_1\"))) & \"\"","v":""},null,{"$f":"IF(CR$2=\"\",\"\",INDIRECT(ADDRESS($I20,COLUMN(CCR_1!$J$1)+CR$14-1,,,\"CFR_1\"))) & \"\"","v":""},null,{"$f":"IF(CT$2=\"\",\"\",INDIRECT(ADDRESS($I20,COLUMN(CCR_1!$J$1)+CT$14-1,,,\"CFR_1\"))) & \"\"","v":""},null,{"$f":"IF(CV$2=\"\",\"\",INDIRECT(ADDRESS($I20,COLUMN(CCR_1!$J$1)+CV$14-1,,,\"CFR_1\"))) & \"\"","v":""},null,{"$f":"IF(CX$2=\"\",\"\",INDIRECT(ADDRESS($I20,COLUMN(CCR_1!$J$1)+CX$14-1,,,\"CFR_1\"))) & \"\"","v":""},null,{"$f":"IF(CZ$2=\"\",\"\",INDIRECT(ADDRESS($I20,COLUMN(CCR_1!$J$1)+CZ$14-1,,,\"CFR_1\"))) & \"\"","v":""},null,{"$f":"IF(DB$2=\"\",\"\",INDIRECT(ADDRESS($I20,COLUMN(CCR_1!$J$1)+DB$14-1,,,\"CFR_1\"))) & \"\"","v":""},null,{"$f":"IF(DD$2=\"\",\"\",INDIRECT(ADDRESS($I20,COLUMN(CCR_1!$J$1)+DD$14-1,,,\"CFR_1\"))) & \"\"","v":""},null,{"$f":"IF(DF$2=\"\",\"\",INDIRECT(ADDRESS($I20,COLUMN(CCR_1!$J$1)+DF$14-1,,,\"CFR_1\"))) & \"\"","v":""},null,{"$f":"IF(DH$2=\"\",\"\",INDIRECT(ADDRESS($I20,COLUMN(CCR_1!$J$1)+DH$14-1,,,\"CFR_1\"))) & \"\"","v":""},null,{"$f":"IF(DJ$2=\"\",\"\",INDIRECT(ADDRESS($I20,COLUMN(CCR_1!$J$1)+DJ$14-1,,,\"CFR_1\"))) & \"\"","v":""},null,{"$f":"IF(DL$2=\"\",\"\",INDIRECT(ADDRESS($I20,COLUMN(CCR_1!$J$1)+DL$14-1,,,\"CFR_1\"))) & \"\"","v":""},null,{"$f":"IF(DN$2=\"\",\"\",INDIRECT(ADDRESS($I20,COLUMN(CCR_1!$J$1)+DN$14-1,,,\"CFR_1\"))) & \"\"","v":""},null,{"$f":"IF(DP$2=\"\",\"\",INDIRECT(ADDRESS($I20,COLUMN(CCR_1!$J$1)+DP$14-1,,,\"CFR_1\"))) & \"\"","v":""},null,{"$f":"IF(DR$2=\"\",\"\",INDIRECT(ADDRESS($I20,COLUMN(CCR_1!$J$1)+DR$14-1,,,\"CFR_1\"))) & \"\"","v":""},null,{"$f":"IF(DT$2=\"\",\"\",INDIRECT(ADDRESS($I20,COLUMN(CCR_1!$J$1)+DT$14-1,,,\"CFR_1\"))) & \"\"","v":""},null,{"$f":"IF(DV$2=\"\",\"\",INDIRECT(ADDRESS($I20,COLUMN(CCR_1!$J$1)+DV$14-1,,,\"CFR_1\"))) & \"\"","v":""},null,{"$f":"IF(DX$2=\"\",\"\",INDIRECT(ADDRESS($I20,COLUMN(CCR_1!$J$1)+DX$14-1,,,\"CFR_1\"))) & \"\"","v":""},null,{"$f":"IF(DZ$2=\"\",\"\",INDIRECT(ADDRESS($I20,COLUMN(CCR_1!$J$1)+DZ$14-1,,,\"CFR_1\"))) & \"\"","v":""},null,{"$f":"IF(EB$2=\"\",\"\",INDIRECT(ADDRESS($I20,COLUMN(CCR_1!$J$1)+EB$14-1,,,\"CFR_1\"))) & \"\"","v":""},null,{"$f":"IF(ED$2=\"\",\"\",INDIRECT(ADDRESS($I20,COLUMN(CCR_1!$J$1)+ED$14-1,,,\"CFR_1\"))) & \"\"","v":""},null,{"$f":"IF(EF$2=\"\",\"\",INDIRECT(ADDRESS($I20,COLUMN(CCR_1!$J$1)+EF$14-1,,,\"CFR_1\"))) & \"\"","v":""},null,{"$f":"IF(EH$2=\"\",\"\",INDIRECT(ADDRESS($I20,COLUMN(CCR_1!$J$1)+EH$14-1,,,\"CFR_1\"))) & \"\"","v":""},null,{"$f":"IF(EJ$2=\"\",\"\",INDIRECT(ADDRESS($I20,COLUMN(CCR_1!$J$1)+EJ$14-1,,,\"CFR_1\"))) & \"\"","v":""},null,{"$f":"IF(EL$2=\"\",\"\",INDIRECT(ADDRESS($I20,COLUMN(CCR_1!$J$1)+EL$14-1,,,\"CFR_1\"))) & \"\"","v":""},null,{"$f":"IF(EN$2=\"\",\"\",INDIRECT(ADDRESS($I20,COLUMN(CCR_1!$J$1)+EN$14-1,,,\"CFR_1\"))) & \"\"","v":""},null,{"$f":"IF(EP$2=\"\",\"\",INDIRECT(ADDRESS($I20,COLUMN(CCR_1!$J$1)+EP$14-1,,,\"CFR_1\"))) & \"\"","v":""},null,{"$f":"IF(ER$2=\"\",\"\",INDIRECT(ADDRESS($I20,COLUMN(CCR_1!$J$1)+ER$14-1,,,\"CFR_1\"))) & \"\"","v":""},null,{"$f":"IF(ET$2=\"\",\"\",INDIRECT(ADDRESS($I20,COLUMN(CCR_1!$J$1)+ET$14-1,,,\"CFR_1\"))) & \"\"","v":""},null,{"$f":"IF(EV$2=\"\",\"\",INDIRECT(ADDRESS($I20,COLUMN(CCR_1!$J$1)+EV$14-1,,,\"CFR_1\"))) & \"\"","v":""},null,{"$f":"IF(EX$2=\"\",\"\",INDIRECT(ADDRESS($I20,COLUMN(CCR_1!$J$1)+EX$14-1,,,\"CFR_1\"))) & \"\"","v":""},null,{"$f":"IF(EZ$2=\"\",\"\",INDIRECT(ADDRESS($I20,COLUMN(CCR_1!$J$1)+EZ$14-1,,,\"CFR_1\"))) & \"\"","v":""},null,{"$f":"IF(FB$2=\"\",\"\",INDIRECT(ADDRESS($I20,COLUMN(CCR_1!$J$1)+FB$14-1,,,\"CFR_1\"))) & \"\"","v":""},null,{"$f":"IF(FD$2=\"\",\"\",INDIRECT(ADDRESS($I20,COLUMN(CCR_1!$J$1)+FD$14-1,,,\"CFR_1\"))) & \"\"","v":""},null,{"$f":"IF(FF$2=\"\",\"\",INDIRECT(ADDRESS($I20,COLUMN(CCR_1!$J$1)+FF$14-1,,,\"CFR_1\"))) & \"\"","v":""},null,{"$f":"IF(FH$2=\"\",\"\",INDIRECT(ADDRESS($I20,COLUMN(CCR_1!$J$1)+FH$14-1,,,\"CFR_1\"))) & \"\"","v":""},null,{"$f":"IF(FJ$2=\"\",\"\",INDIRECT(ADDRESS($I20,COLUMN(CCR_1!$J$1)+FJ$14-1,,,\"CFR_1\"))) & \"\"","v":""},null,{"$f":"IF(FL$2=\"\",\"\",INDIRECT(ADDRESS($I20,COLUMN(CCR_1!$J$1)+FL$14-1,,,\"CFR_1\"))) & \"\"","v":""}]
[null,"Total",null,null,null,null,null,null,null,{"$f":"+SUM(J24:J43)","v":0},0,0,0,0,0,0,0,0,0,0,0,0,0,0,0,0,0,0,0,0,0,0,0,0,0,0,0,0,0,0,0,{"$f":"+SUM(AP24:AP43)","v":0},0,0,0,0,0,0,0,0,0,0,0,0,0,0,0,0,0,0,0,0,0,0,0,0,0,0,0,0,0,0,0,{"$f":"+SUM(BV24:BV43)","v":0},0,0,0,0,0,0,0,0,0,0,0,0,0,0,0,0,0,0,0,0,0,0,0,0,0,0,0,0,0,0,0,{"$f":"+SUM(DB24:DB43)","v":0},0,0,0,0,0,0,0,0,0,0,0,0,0,0,0,0,0,0,0,0,0,0,0,0,0,0,0,0,0,0,0,{"$f":"+SUM(EH24:EH43)","v":0},0,0,0,0,0,0,0,0,0,0,0,0,0,0,0,0,0,0,0,0,0,0,0,0,0,0,0,0,0,0,0]
[null,"Position Title",null,null,null,null,"Total - Paid",null,null,"Hours Paid","Amount Paid","Hours Paid","Amount Paid","Hours Paid","Amount Paid","Hours Paid","Amount Paid","Hours Paid","Amount Paid","Hours Paid","Amount Paid","Hours Paid","Amount Paid","Hours Paid","Amount Paid","Hours Paid","Amount Paid","Hours Paid","Amount Paid","Hours Paid","Amount Paid","Hours Paid","Amount Paid","Hours Paid","Amount Paid","Hours Paid","Amount Paid","Hours Paid","Amount Paid","Hours Paid","Amount Paid","Hours Paid","Amount Paid","Hours Paid","Amount Paid","Hours Paid","Amount Paid","Hours Paid","Amount Paid","Hours Paid","Amount Paid","Hours Paid","Amount Paid","Hours Paid","Amount Paid","Hours Paid","Amount Paid","Hours Paid","Amount Paid","Hours Paid","Amount Paid","Hours Paid","Amount Paid","Hours Paid","Amount Paid","Hours Paid","Amount Paid","Hours Paid","Amount Paid","Hours Paid","Amount Paid","Hours Paid","Amount Paid","Hours Paid","Amount Paid","Hours Paid","Amount Paid","Hours Paid","Amount Paid","Hours Paid","Amount Paid","Hours Paid","Amount Paid","Hours Paid","Amount Paid","Hours Paid","Amount Paid","Hours Paid","Amount Paid","Hours Paid","Amount Paid","Hours Paid","Amount Paid","Hours Paid","Amount Paid","Hours Paid","Amount Paid","Hours Paid","Amount Paid","Hours Paid","Amount Paid","Hours Paid","Amount Paid","Hours Paid","Amount Paid","Hours Paid","Amount Paid","Hours Paid","Amount Paid","Hours Paid","Amount Paid","Hours Paid","Amount Paid","Hours Paid","Amount Paid","Hours Paid","Amount Paid","Hours Paid","Amount Paid","Hours Paid","Amount Paid","Hours Paid","Amount Paid","Hours Paid","Amount Paid","Hours Paid","Amount Paid","Hours Paid","Amount Paid","Hours Paid","Amount Paid","Hours Paid","Amount Paid","Hours Paid","Amount Paid","Hours Paid","Amount Paid","Hours Paid","Amount Paid","Hours Paid","Amount Paid","Hours Paid","Amount Paid","Hours Paid","Amount Paid","Hours Paid","Amount Paid","Hours Paid","Amount Paid","Hours Paid","Amount Paid","Hours Paid","Amount Paid","Hours Paid","Amount Paid","Hours Paid","Amount Paid","Hours Paid","Amount Paid","Hours Paid","Amount Paid","Hours Paid","Amount Paid","Hours Paid","Amount Paid","Hours Paid","Amount Paid","Hours Paid","Amount Paid"]
[null,null,null,null,null,null,"Hours","Amount"]
[]
[]
[]
[]
[]
[]
[]
[]
[]
[]
[]
[]
[]
[]
[]
[]
[]
[]
[]
["Total \"Hours Paid\", \"FTE\" and \"Amount Paid\" for Positions."]
["Totals are transferred to Schedule CCR-1 Line 27 (Program/Site)."]

{"sheet":"Admin","index":6,"n_rows":1,"n_cols":4,"rows_kept":1,"cut":false,"hidden":false,"merged":[]}
["Program Type","Program Type","Service Type","Program Code"]

{"sheet":"Table","index":7,"n_rows":95,"n_cols":22,"rows_kept":95,"cut":false,"hidden":true,"merged":[[17,4,17,5],[17,6,17,7],[17,8,17,9]]}
[{"$f":"+COLUMN()","v":1},2,3,4,5,6,7,8,9,10,11,12,13,14,15,16,17,18,19,20,21,22]
[null,"OCFS","DOH","DOH","DOH","DOH"]
[null,"Bridges to Health","TBI","NHTD","CAH I & II","CAH II"]
[]
["Count",{"$f":"COUNTIFS($B20:$B991,B$7)","v":27},{"$f":"COUNTIFS($B20:$B991,C$7)","v":17},{"$f":"COUNTIFS($B20:$B991,D$7)","v":22},{"$f":"COUNTIFS($B20:$B1001,E$7)","v":10},{"$f":"COUNTIFS($B20:$B1001,F$7)","v":0},{"$f":"+SUM(B5:F5)","v":76}]
[null,"OCFS","DOH","DOH","DOH","DOH"]
["Short","OCFS","TBI","NHTD","CAH I & II","CAH II"]
[]
[]
[]
[]
[]
[]
[]
[]
[]
[]
[null,null,null,null,1,null,2,null,3]
["TID","Agency","Program ID Number","Program\nName (Short)","Rate Code","Type Code","Rate Code","Type Code","Rate Code","Type Code","Rate Code Description","Rate Type"]
[{"$f":"$B20&\".\"&COUNTIFS($B$20:$B20,$B20)","v":"NHTD.1"},"NHTD",11001,"V-Adap",9750,27,null,null,null,null,"Vehicle Adaption","Cost"]
[{"$f":"$B21&\".\"&COUNTIFS($B$20:$B21,$B21)","v":"NHTD.2"},"NHTD",11002,"AT",9752,27,null,null,null,null,"Assistive Technology","Cost"]
[{"$f":"$B22&\".\"&COUNTIFS($B$20:$B22,$B22)","v":"NHTD.3"},"NHTD",11003,"CIC",9755,18,null,null,null,null,"Community Integration Counseling","Hourly"]
[{"$f":"$B23&\".\"&COUNTIFS($B$20:$B23,$B23)","v":"NHTD.4"},"NHTD",11004,"ILST",9756,10,null,null,null,null,"Independent Living Skills","Hourly"]
[{"$f":"$B24&\".\"&COUNTIFS($B$20:$B24,$B24)","v":"NHTD.5"},"NHTD",11005,"PBIS",9757,10,null,null,null,null,"Postive Behavioral Interventions","Hourly"]
[{"$f":"$B25&\".\"&COUNTIFS($B$20:$B25,$B25)","v":"NHTD.6"},"NHTD",11006,"CTS",9758,27,null,null,null,null,"Community Transitional Services","Cost"]
[{"$f":"$B26&\".\"&COUNTIFS($B$20:$B26,$B26)","v":"NHTD.7"},"NHTD",11007,"E-Mods",9762,27,null,null,null,null,"Environmental Modifications","Cost"]
[{"$f":"$B27&\".\"&COUNTIFS($B$20:$B27,$B27)","v":"NHTD.8"},"NHTD",11008,"NC",9763,10,null,null,null,null,"Nutritonal Counseling Level 1","Hourly"]
[{"$f":"$B28&\".\"&COUNTIFS($B$20:$B28,$B28)","v":"NHTD.9"},"NHTD",11009,"Respite",9768,2,null,null,null,null,"Respite, in Home (1 day max)","Daily"]
[{"$f":"$B29&\".\"&COUNTIFS($B$20:$B29,$B29)","v":"NHTD.10"},"NHTD",11010,"RC",9769,10,null,null,null,null,"Respiratory Therapy Level 1","Hourly"]
[{"$f":"$B30&\".\"&COUNTIFS($B$20:$B30,$B30)","v":"NHTD.11"},"NHTD",11011,"SC",9772,3,null,null,null,null,"Initial Service Coordination/Trans Level I","Yearly"]
[{"$f":"$B31&\".\"&COUNTIFS($B$20:$B31,$B31)","v":"NHTD.12"},"NHTD",11012,"SC",9773,3,null,null,null,null,"Initial Service Coordination/Trans Level II","Yearly"]
[{"$f":"$B32&\".\"&COUNTIFS($B$20:$B32,$B32)","v":"NHTD.13"},"NHTD",11013,"SC",9774,3,null,null,null,null,"Initial Service Coordination/Diversion","Yearly"]
[{"$f":"$B33&\".\"&COUNTIFS($B$20:$B33,$B33)","v":"NHTD.14"},"NHTD",11014,"SC",9775,4,null,null,null,null,"Ongoing Service Coordination","Monthly"]
[{"$f":"$B34&\".\"&COUNTIFS($B$20:$B34,$B34)","v":"NHTD.15"},"NHTD",11015,"SDP",9777,10,null,null,null,null,"Structured Day Program Level I","Hourly"]
[{"$f":"$B35&\".\"&COUNTIFS($B$20:$B35,$B35)","v":"NHTD.16"},"NHTD",11016,"PM",9780,10,null,null,null,null,"Peer Mentoring","Hourly"]
[{"$f":"$B36&\".\"&COUNTIFS($B$20:$B36,$B36)","v":"NHTD.17"},"NHTD",11017,"C&HM",9781,27,null,null,null,null,"Congregate and Home Delivered Meals","Cost"]
[{"$f":"$B37&\".\"&COUNTIFS($B$20:$B37,$B37)","v":"NHTD.18"},"NHTD",11018,"Wellness",9785,2,null,null,null,null,"Wellness Counseling","Hourly"]
[{"$f":"$B38&\".\"&COUNTIFS($B$20:$B38,$B38)","v":"NHTD.19"},"NHTD",11019,"HV",9786,15,null,null,null,null,"Home Visits by Medical Personnel","Hourly"]
[{"$f":"$B39&\".\"&COUNTIFS($B$20:$B39,$B39)","v":"NHTD.20"},"NHTD",11020,"MA",9787,27,null,null,null,null,"Moving Assistance","Cost"]
[{"$f":"$B40&\".\"&COUNTIFS($B$20:$B40,$B40)","v":"NHTD.21"},"NHTD",11021,"HCSS",9795,10,null,null,null,null,"HCSS Level 1","Hourly"]
[{"$f":"$B41&\".\"&COUNTIFS($B$20:$B41,$B41)","v":"NHTD.22"},"NHTD",11022,"HCSS",9799,2,null,null,null,null,"HCSS Nursing Visit","Daily"]
[{"$f":"$B42&\".\"&COUNTIFS($B$20:$B42,$B42)","v":"TBI.1"},"TBI",12019,"SC",9850,3,null,null,null,null,"Service Coordination Initial ","One Time"]
[{"$f":"$B43&\".\"&COUNTIFS($B$20:$B43,$B43)","v":"TBI.2"},"TBI",12020,"SC",9851,4,null,null,null,null,"Service Coordination Monthly","Monthly"]
[{"$f":"$B44&\".\"&COUNTIFS($B$20:$B44,$B44)","v":"TBI.3"},"TBI",12021,"AT",9857,27,null,null,null,null,"Assistive Technology - Special/Equipment/Supplies","Cost"]
[{"$f":"$B45&\".\"&COUNTIFS($B$20:$B45,$B45)","v":"TBI.4"},"TBI",12022,"ILST",9858,10,null,null,null,null,"Independent Living Skills","Hourly"]
[{"$f":"$B46&\".\"&COUNTIFS($B$20:$B46,$B46)","v":"TBI.5"},"TBI",12023,"SAP",9859,15,null,null,null,null,"Substance Abuse Program","Hourly"]
[{"$f":"$B47&\".\"&COUNTIFS($B$20:$B47,$B47)","v":"TBI.6"},"TBI",12024,"PBIS",9860,10,null,null,null,null,"Postive Behavioral and Supports","Hourly"]
[{"$f":"$B48&\".\"&COUNTIFS($B$20:$B48,$B48)","v":"TBI.7"},"TBI",12025,"CIC",9861,10,null,null,null,null,"Community Integration Counseling","Hourly"]
[{"$f":"$B49&\".\"&COUNTIFS($B$20:$B49,$B49)","v":"TBI.8"},"TBI",12026,"HCSS",9863,10,null,null,null,null,"Home and Community Support","Hourly"]
[{"$f":"$B50&\".\"&COUNTIFS($B$20:$B50,$B50)","v":"TBI.9"},"TBI",12027,"CTS",9867,27,null,null,null,null,"Community Transitional Services","Cost"]
[{"$f":"$B51&\".\"&COUNTIFS($B$20:$B51,$B51)","v":"TBI.10"},"TBI",12028,"SDP",9870,15,null,null,null,null,"Structured Day Programs","Hourly"]
[{"$f":"$B52&\".\"&COUNTIFS($B$20:$B52,$B52)","v":"TBI.11"},"TBI",12029,"E-Mods",9874,27,null,null,null,null,"Environmental Modifications","Cost"]
[{"$f":"$B53&\".\"&COUNTIFS($B$20:$B53,$B53)","v":"TBI.12"},"TBI",12030,"Respite",9875,2,null,null,null,null,"Respite, in Home (24 Hours)","Daily"]
[{"$f":"$B54&\".\"&COUNTIFS($B$20:$B54,$B54)","v":"TBI.13"},"TBI",12031,"HCSS",9879,"10",null,null,null,null,"NYC Region (Bronx, Kings, NY, Queens, Richmond)","Hourly"]
[{"$f":"$B55&\".\"&COUNTIFS($B$20:$B55,$B55)","v":"TBI.14"},"TBI",12032,"HCSS",9880,"10",null,null,null,null,"Long Island/Westchester Region (Nassau, Suffolk, Westchester)","Hourly"]
[{"$f":"$B56&\".\"&COUNTIFS($B$20:$B56,$B56)","v":"TBI.15"},"TBI",12033,"HCSS",9881,"10",null,null,null,null,"Rockland Region (Rockland)","Hourly"]
[{"$f":"$B57&\".\"&COUNTIFS($B$20:$B57,$B57)","v":"TBI.16"},"TBI",12034,"HCSS",9882,"10",null,null,null,null,"Upstate/Rest of State Region (Rest of State)","Hourly"]
[{"$f":"$B58&\".\"&COUNTIFS($B$20:$B58,$B58)","v":"TBI.17"},"TBI",12035,"HCSS",9883,10,null,null,null,null,"Rural Region (Alleghany, Clinton, Delaware, Essex, Franklin, Hamilton, St Lawrence)","Hourly"]
[{"$f":"$B59&\".\"&COUNTIFS($B$20:$B59,$B59)","v":"OCFS.1"},"OCFS",21030,"HLTH.INTER/HCI",1300,null,1327,null,1354,null,"Health Care Integration (HCI) regular","Monthly"]
[{"$f":"$B60&\".\"&COUNTIFS($B$20:$B60,$B60)","v":"OCFS.2"},"OCFS",20032,"HCI.Enroll",1301,null,1328,null,1355,null,"HCI Enrollment/ Hospitalization Occurance (1-10 days)/ Hospitalization Occuarance (11-30 days)","Monthly"]
[{"$f":"$B61&\".\"&COUNTIFS($B$20:$B61,$B61)","v":"OCFS.3"},"OCFS",20034,"HCIA",1302,null,1329,null,1356,null,"Health Care Integration (HCIA) Number of Days must be > or = 11 days but less than 21","Half Month"]
[{"$f":"$B62&\".\"&COUNTIFS($B$20:$B62,$B62)","v":"OCFS.4"},"OCFS",20035,"Trans.New.HCIA",1303,null,1330,null,1357,null,"HCIA Transfer to a New HCIA- for case transfers to another HCIA. Number of Days must be >  or = 11 days but less than 21","Half Month"]
[{"$f":"$B63&\".\"&COUNTIFS($B$20:$B63,$B63)","v":"OCFS.5"},"OCFS",20036,"HOSP.1.to.10",1304,null,1331,null,1358,null,"Hospitalization Occurrence from 1-10 days","Monthly"]
[{"$f":"$B64&\".\"&COUNTIFS($B$20:$B64,$B64)","v":"OCFS.6"},"OCFS",20037,"HOSP.10.to.30",1305,null,1332,null,1359,null,"Hospitalization Occurrence from 11-30 days","Monthly"]
[{"$f":"$B65&\".\"&COUNTIFS($B$20:$B65,$B65)","v":"OCFS.7"},"OCFS",20038,"FAM.Care.Indiv",1306,null,1333,null,1360,null,"Family Caregiver Individual","15 minute"]
[{"$f":"$B66&\".\"&COUNTIFS($B$20:$B66,$B66)","v":"OCFS.8"},"OCFS",20039,"FAM.Care.GRP",1307,null,1334,null,1361,null,"Family Caregiver Group","15 minute"]
[{"$f":"$B67&\".\"&COUNTIFS($B$20:$B67,$B67)","v":"OCFS.9"},"OCFS",20040,"SKL.Build/INDV",1308,null,1335,null,1362,null,"Skill Building Idividual","15 minute"]
[{"$f":"$B68&\".\"&COUNTIFS($B$20:$B68,$B68)","v":"OCFS.10"},"OCFS",20041,"SKL.Build/GRP",1309,null,1336,null,1363,null,"Skill Building Group","15 minute"]
[{"$f":"$B69&\".\"&COUNTIFS($B$20:$B69,$B69)","v":"OCFS.11"},"OCFS",20042,"DAY.HAB.INDV",1310,null,1337,null,1364,null,"Day Habilitation Individual","Hourly"]
[{"$f":"$B70&\".\"&COUNTIFS($B$20:$B70,$B70)","v":"OCFS.12"},"OCFS",20043,"DAY.HAB.GRP",1311,null,1338,null,1365,null,"Day Habilitation Group","Hourly"]
[{"$f":"$B71&\".\"&COUNTIFS($B$20:$B71,$B71)","v":"OCFS.13"},"OCFS",20044,"SPCL.Need.Comm.INDV",1312,null,1339,null,1366,null,"Special Needs Community Advocacy & Support Individual","15 minute"]
[{"$f":"$B72&\".\"&COUNTIFS($B$20:$B72,$B72)","v":"OCFS.14"},"OCFS",20045,"SPCL.Need.Comm.GRP",1313,null,1340,null,1367,null,"Special Needs Community Advocacy & Support Group","15 minute"]
[{"$f":"$B73&\".\"&COUNTIFS($B$20:$B73,$B73)","v":"OCFS.15"},"OCFS",20046,"PRE.VOC.INDV",1314,null,1341,null,1368,null,"Prevocational Services Individual","Hourly"]
[{"$f":"$B74&\".\"&COUNTIFS($B$20:$B74,$B74)","v":"OCFS.16"},"OCFS",20047,"PRE.VOC.GRP",1315,null,1342,null,1369,null,"Prevocational Services Group","Hourly"]
[{"$f":"$B75&\".\"&COUNTIFS($B$20:$B75,$B75)","v":"OCFS.17"},"OCFS",20048,"SEMP",1316,null,1343,null,1370,null,"Supportive Employment","Hourly"]
[{"$f":"$B76&\".\"&COUNTIFS($B$20:$B76,$B76)","v":"OCFS.18"},"OCFS",20049,"RESP.LESS.4",1317,null,1344,null,1371,null,"Respite Services less than 4 hours per day","15 minute"]
[{"$f":"$B77&\".\"&COUNTIFS($B$20:$B77,$B77)","v":"OCFS.19"},"OCFS",20050,"RESP.MORE.4",1318,null,1345,null,1372,null,"Respite Services more than 4 hours per day","Daily"]
[{"$f":"$B78&\".\"&COUNTIFS($B$20:$B78,$B78)","v":"OCFS.20"},"OCFS",20051,"Crisis.AVOID.MGMT.INDV",1319,null,1346,null,1373,null,"Crisis Advoidance & Management Training Individual","15 minute"]
[{"$f":"$B79&\".\"&COUNTIFS($B$20:$B79,$B79)","v":"OCFS.21"},"OCFS",20052,"Crisis.AVOID.MGMT.GRP",1320,null,1347,null,1374,null,"Crisis Advoidance & Management Training Group","15 minute"]
[{"$f":"$B80&\".\"&COUNTIFS($B$20:$B80,$B80)","v":"OCFS.22"},"OCFS",20053,"Crisis.IMMED.SRV",1321,null,1348,null,1375,null,"Immediate Crisis Response Services ","15 minute"]
[{"$f":"$B81&\".\"&COUNTIFS($B$20:$B81,$B81)","v":"OCFS.23"},"OCFS",20054,"INTENSE.Home.Supp",1322,null,1349,null,1376,null,"Intensive In-Home Supports & Services","15 minute"]
[{"$f":"$B82&\".\"&COUNTIFS($B$20:$B82,$B82)","v":"OCFS.24"},"OCFS",20055,"Crisis.RESP.Less.4",1323,null,1350,null,1377,null,"Crisis Respite- Less than 4 hours per day","15 minute"]
[{"$f":"$B83&\".\"&COUNTIFS($B$20:$B83,$B83)","v":"OCFS.25"},"OCFS",20056,"Crisis.RESP.More.4",1324,null,1351,null,1378,null," Crisis Respite- More than 4 hours per day","Daily"]
[{"$f":"$B84&\".\"&COUNTIFS($B$20:$B84,$B84)","v":"OCFS.26"},"OCFS",20057,"ADAPT.ASSIST",1325,null,1352,null,1379,null,"Adaptive and Assistive Equipment","Contracts"]
[{"$f":"$B85&\".\"&COUNTIFS($B$20:$B85,$B85)","v":"OCFS.27"},"OCFS",20058,"ACCESS.MOD",1326,null,1353,null,1380,null,"Accessibility Modifications","Contracts"]
[{"$f":"$B86&\".\"&COUNTIFS($B$20:$B86,$B86)","v":"CAH I & II.1"},"CAH I & II",13001,"CAH.Case.Mgmt.Lvl1",2301,26,null,null,null,null,"Case Management","15 minutes"]
[{"$f":"$B87&\".\"&COUNTIFS($B$20:$B87,$B87)","v":"CAH I & II.2"},"CAH I & II",15001,"CAH.PC.Family Education",2332,26,null,null,null,null,"Family Palliative Care Education (Training)","30 minutes"]
[{"$f":"$B88&\".\"&COUNTIFS($B$20:$B88,$B88)","v":"CAH I & II.3"},"CAH I & II",15002,"CAH.PC.Bereavement Srv",2334,26,null,null,null,null,"Bereavement Services","30 minutes"]
[{"$f":"$B89&\".\"&COUNTIFS($B$20:$B89,$B89)","v":"CAH I & II.4"},"CAH I & II",15003,"CAH.PC.Massage Therapy",2335,26,null,null,null,null,"Massage Therapy","30 minutes"]
[{"$f":"$B90&\".\"&COUNTIFS($B$20:$B90,$B90)","v":"CAH I & II.5"},"CAH I & II",15004,"CAH.PC.Expressive Ther",2336,26,null,null,null,null,"Expressive Therapy","30 minutes"]
[{"$f":"$B91&\".\"&COUNTIFS($B$20:$B91,$B91)","v":"CAH I & II.6"},"CAH I & II",14001,"CAH.Case.Mgmt.Lvl2",2302,26,null,null,null,null,"Case Management","15 minutes"]
[{"$f":"$B92&\".\"&COUNTIFS($B$20:$B92,$B92)","v":"CAH I & II.7"},"CAH I & II",15001,"CAH.PC.Family Education",2332,26,null,null,null,null,"Family Palliative Care Education (Training)","30 minutes"]
[{"$f":"$B93&\".\"&COUNTIFS($B$20:$B93,$B93)","v":"CAH I & II.8"},"CAH I & II",15002,"CAH.PC.Bereavement Srv",2334,26,null,null,null,null,"Bereavement Services","30 minutes"]
[{"$f":"$B94&\".\"&COUNTIFS($B$20:$B94,$B94)","v":"CAH I & II.9"},"CAH I & II",15003,"CAH.PC.Massage Therapy",2335,26,null,null,null,null,"Massage Therapy","30 minutes"]
[{"$f":"$B95&\".\"&COUNTIFS($B$20:$B95,$B95)","v":"CAH I & II.10"},"CAH I & II",15004,"CAH.PC.Expressive Ther",2336,26,null,null,null,null,"Expressive Therapy","30 minutes"]

{"sheet":"CFR_4a (2)","index":8,"n_rows":48,"n_cols":24,"rows_kept":48,"cut":false,"hidden":true,"merged":[[3,9,3,13],[4,9,4,13],[6,0,6,1],[6,2,6,5],[7,0,7,1],[7,6,8,6],[7,7,8,7],[8,0,8,1],[15,0,23,0],[22,1,23,2],[22,3,22,6],[22,7,23,7],[22,8,23,8],[29,1,29,2],[30,1,30,2],[31,1,31,2],[13,13,13,14],[14,13,14,14],[22,9,23,9],[22,10,23,10],[22,11,23,11],[28,1,28,2],[22,12,23,12],[22,13,23,13],[22,14,23,14],[27,1,27,2],[22,15,23,15],[22,18,23,18],[24,1,24,2],[25,1,25,2],[26,1,26,2],[22,16,23,16],[22,17,23,17],[32,1,32,2],[33,1,33,2],[41,1,41,2],[42,1,42,2],[43,0,43,6],[35,1,35,2],[36,1,36,2],[37,1,37,2],[38,1,38,2],[39,1,39,2],[40,1,40,2],[34,1,34,2]]}
[{"$f":"COLUMN()","v":1},{"$f":"COLUMN()","v":2},{"$f":"COLUMN()","v":3},{"$f":"COLUMN()","v":4},{"$f":"COLUMN()","v":5},{"$f":"COLUMN()","v":6},{"$f":"COLUMN()","v":7},{"$f":"COLUMN()","v":8},{"$f":"COLUMN()","v":9},{"$f":"COLUMN()","v":10},{"$f":"COLUMN()","v":11},{"$f":"COLUMN()","v":12},{"$f":"COLUMN()","v":13},{"$f":"COLUMN()","v":14},{"$f":"COLUMN()","v":15},{"$f":"COLUMN()","v":16},{"$f":"COLUMN()","v":17},{"$f":"COLUMN()","v":18},{"$f":"COLUMN()","v":19},{"$f":"COLUMN()","v":20},{"$f":"COLUMN()","v":21},{"$f":"COLUMN()","v":22},{"$f":"COLUMN()","v":23},{"$f":"COLUMN()","v":24}]
["Q "]
["Agency Name"]
["Agency Code",null,null,null,null,null,null,null,null,"NEW YORK STATE"]
[null,null,null,null,null,null,null,null,null,"CONSOLIDATED FISCAL REPORT"]
["Funding State Agency",null,null,null,null,null,"Period"]
["OCFS",null,"DOH",null,null,null,"Start Date","End Date",null,"SCHEDULE CFR-4"]
["Bridges to Health",null,"TBI","NHTD","CAH I ","CAH II",null,null,null,"PERSONAL"]
[null,null,null,null,null,null,null,null,null,"SERVICES",null,null,null,"Rev. Mar. 2017"]
[]
["Provide all applicable information. Refer to Appendix R for Position Title Codes and Definitions."]
["Indicate the standard work week or provide the number of hours in the \"other\" column."]
["Indicate the applicable staffing category on the line below to which each page applies."]
[null,"PROGRAM/SITE-PROGRAM ADMIN./LGU ADMIN. (Position Title Codes 100-599 and 700-700-799 series)"]
[null,"AGENCY ADMINISTRATION (Position Title Codes 600-699 series) *"]
["Position\nTitle Code\nAppendix\nR","Column Number"]
[null,"PROGRAM CODE ** (PROGRAM CODE INDEX)"]
[null,"PROGRAM/SITE IDENTIFICATION NUMBER **"]
[null,"PROGRAM/SITE NAME"]
[null,"PROGRAM/SITE ADDRESS (Line One)"]
[null,"PROGRAM/SITE ADDRESS (Line Two)"]
[null,"COUNTY CODE"]
[null,"Position Title",null,"Standard Work Week",null,null,null,"Hours Paid","Amount Paid","Hours Paid","Amount Paid","Hours Paid","Amount Paid","Hours Paid","Amount Paid","Hours Paid","Amount Paid","Hours Paid","Amount Paid"]
[null,null,null,35,37.5,40,"Other"]
[]
[]
[]
[]
[]
[]
[]
[]
[]
[]
[]
[]
[]
[]
[]
[]
[]
[]
[]
["Total \"Hours Paid\", \"FTE\" and \"Amount Paid\" for Positions."]
["* Report Agency Administration in one column on a separate page."]
["** For OASAS, program code = service level and program/site = PRU level."]
["Totals are transferred to Schedule CFR-1 Line 16 (Program/Site, Program Administration & LGU Administration), or Schedule CFR-3 Line 1 (Agency Administration)."]
["Note: FTE's do not get transferred."]